program: Gaussian 09
title: 000173917
version: EM64L-G09RevD.01
frameworkgroup: C1[X(C14H4Cl5F3N2O)]
method: RPBEPBE
basis: SDD
operation: Freq
keyword: #p
keyword: freq=noraman
keyword: PBEPBE/SDD
title: #p freq=noraman PBEPBE/SDD
converged: YES YES NO NO
title: Mulliken charges:
elementType: Cl Cl Cl Cl Cl F F F O N N C C C C C C C C C C C C C C H H H H
charge: 0.027687 0.006678 -0.005710 0.020182 0.023163 -0.127400 -0.163036 -0.133841 -0.274990 -0.436529 0.038223 0.239858 0.202899 0.387518 0.107388 -0.343317 -0.342664 -0.260470 0.265976 0.513123 -0.339900 -0.251188 -0.078313 -0.188148 -0.106940 0.358488 0.283326 0.287885 0.290051
chargesum: 0.00000
title: Mulliken charges with hydrogens summed into heavy atoms:
elementType: Cl Cl Cl Cl Cl F F F O N N C C C C C C C C C C C C C C
charge: 0.027687 0.006678 -0.005710 0.020182 0.023163 -0.127400 -0.163036 -0.133841 -0.274990 -0.078041 0.038223 0.239858 0.202899 0.387518 0.107388 -0.343317 -0.342664 0.022856 0.265976 0.513123 -0.339900 0.036697 -0.078313 0.101903 -0.106940
polarizability: 2.76833134e+02 5.14759206e+00 2.54145360e+02 2.93982675e+00 -1.38893711e+01 1.46277187e+02
1716.lowfreq: -4.9120 -3.5118 -2.5686 -0.0016 0.0009 0.0016 6.4908 15.3312 25.0830
frequency: 6.0423 15.3236 25.0728 28.0099 58.8685 65.0552 87.9935 98.5981 125.3977 131.4031 151.1970 164.3318 181.8248 186.5198 201.4067 208.8448 228.3644 243.5748 270.4405 279.7215 307.6203 329.9387 349.0591 366.2861 372.6468 383.7804 406.9078 429.7445 452.9899 487.2013 492.2947 502.4149 511.6044 560.2288 571.7381 597.6544 606.9050 628.0395 653.2200 660.6739 679.2286 701.0078 715.6526 733.5709 741.6767 760.7864 786.2111 847.5270 849.5705 867.3404 873.5296 917.3435 963.4196 1006.1412 1021.1935 1028.5722 1039.0660 1080.3485 1109.3886 1180.0871 1211.3753 1220.0837 1232.7961 1248.5031 1285.6409 1323.7258 1330.2731 1362.1894 1385.6599 1412.5844 1438.1808 1472.3341 1512.2777 1559.3977 1571.7041 1584.4182 1625.7325 3175.6461 3182.2086 3183.8137 3495.1367
redmass: 19.0038 20.7568 15.7325 22.3012 20.7207 23.2620 16.6181 17.1064 24.4893 11.6959 11.7182 19.5751 25.6364 10.5417 6.7932 13.3781 11.1972 9.2852 16.5406 16.0593 22.7452 14.5426 10.2237 15.7719 13.5712 13.7082 13.2393 4.3999 5.3546 14.1997 11.8840 11.3592 7.0306 7.7131 4.3992 10.0705 8.6545 9.8830 8.4687 6.0152 6.5714 8.0142 7.6387 1.1399 10.1437 9.9246 8.9046 1.5597 1.4205 1.4074 9.8053 11.2868 8.1904 10.8821 10.6215 8.5871 5.5866 4.8899 1.7782 2.3569 3.7307 4.7383 1.2494 4.3050 2.6210 9.1355 6.9645 10.7741 6.1770 6.8544 3.0140 4.9899 6.5660 9.4894 9.2933 9.4329 9.6966 1.0928 1.0933 1.0927 1.0840
irintensity: 0.0673 0.0745 0.3006 0.1122 0.3921 0.0415 0.3026 1.2767 0.0023 0.1039 0.0100 1.0274 0.2182 3.5435 1.4863 1.1870 2.9385 1.6992 0.7143 3.5234 0.2125 0.4567 2.1991 5.0844 0.5656 6.0519 24.1169 11.7787 5.3193 2.7902 3.6447 6.6871 2.4718 23.0484 4.3942 6.1271 10.4755 10.6520 25.6777 12.4874 8.1032 16.9596 4.2903 80.5678 17.5200 32.1759 0.8837 0.3986 18.6961 41.7423 17.6811 41.1980 143.1830 85.3077 210.8664 158.0165 58.2015 191.8931 69.8355 26.8204 107.0086 160.5449 11.2055 50.1492 292.2486 51.7212 24.9521 6.5471 96.1218 29.3177 278.7223 119.3569 45.5311 3.8845 13.1883 15.4920 18.1133 3.5492 1.6952 2.0647 239.7235
temp: 298.150 k
press: 1.00000 atm
elementType: 17 17 17 17 17 9 9 9 8 7 7 6 6 6 6 6 6 6 6 6 6 6 6 6 6 1 1 1 1
symmnumber: 1
zpe: 401612.0 jmol-1
zpe.correction: 0.152966 hartree
zpe.thermalcorrener: 0.175742 hartree
zpe.thermalcorrenthalpy: 0.176686 hartree
zpe.thermalcorrgfe: 0.095508 hartree
zpe.sumelectzpe: -3318.668315 hartree
zpe.sumelectthermal: -3318.645539 hartree
zpe.sumelectthermalent: -3318.644595 hartree
zpe.sumelectthermalfe: -3318.725773 hartree
dipole: -2.9079 0.8522 1.2249
dipole: 3.2684
quadrupole: -195.7346 -172.4438 -182.3963
quadrupole: 10.5146 4.0164 -4.2607
quadrupole: -12.2097 11.0811 1.1286 10.5146 4.0164 -4.2607
hfenergy: -3318.8212807 hartree
pointgroup: C01 [X(C14H4Cl5F3N2O1)]
dipole: 1.1375215 0.4698855 -0.3724416 debye
polarizability: 277.0962493|-5.2864585|244.9676144|4.6940371|32.4318399|155.1918173 unknown
InChI: InChI=1S/C14H4Cl5F3N2O/c15-4-1-6(17)9(3-5(4)16)25-12-8(19)2-7(18)10-11(12)24-13(23-10)14(20,21)22/h1-3,24H
charge 0 multiplicity 1
29 atoms
Cl -4.2922 2.430869 1.624958
Cl 0.478201 4.044992 -0.703808
Cl 1.625577 -1.659589 -2.461982
Cl 4.532685 1.572163 2.268563
Cl 5.792354 -1.260124 1.166408
F  -4.104006 -3.137343 -0.633838
F  -1.883586 -3.614831 -0.817092
F  -2.878648 -3.516888 1.227627
O  0.820865 1.034039 -1.384323
N  -1.290743 -0.982838 -0.533909
N  -3.233678 -0.504441 0.587585
C  -1.268467 0.387099 -0.293618
C  -2.494137 0.673566 0.403204
C  -0.321895 1.381198 -0.623134
C  -2.48648 -1.457435 0.013989
C  -2.772394 2.01702 0.756773
C  -0.654383 2.70071 -0.271017
C  -1.859692 3.025736 0.412133
C  -2.851048 -2.908267 -0.042875
C  1.944169 0.497756 -0.706995
C  2.484588 -0.726385 -1.162072
C  2.581548 1.18938 0.344824
C  3.748514 0.657227 0.926098
C  3.65777 -1.255043 -0.596855
C  4.292912 -0.557983 0.452216
H  -0.599597 -1.521229 -1.066918
H  -2.067855 4.067415 0.66749
H  2.180547 2.145802 0.690645
H  4.068282 -2.203376 -0.95238
