program: Gaussian 09
title: 000173687
version: EM64L-G09RevD.01
frameworkgroup: C1[X(C15H16O2)]
method: RPBEPBE
basis: SDD
operation: Freq
keyword: #pfreq=noraman
keyword: PBEPBE/SDD
title: #p freq=noraman PBEPBE/SDD
converged: YES YES NO NO
title: Mulliken charges:
elementType: O O C C C C C C C C C C C C C C C H H H H H H H H H H H H H H H H
charge: -0.274835 -0.436430 -0.576855 -0.590992 0.550376 0.526127 -0.545896 -0.428593 -0.391157 -0.378938 0.341108 -0.219002 -0.381857 -0.385956 -0.349274 0.277679 -0.537292 0.220608 0.223354 0.222888 0.225273 0.254773 0.231030 0.231042 0.234102 0.218986 0.241020 0.215603 0.248112 0.219899 0.220085 0.243594 0.351416
chargesum: 0.00000
title: Mulliken charges with hydrogens summed into heavy atoms:
elementType: O O C C C C C C C C C C C C C C C
charge: -0.274835 -0.085014 -0.132893 -0.142832 0.550376 0.526127 -0.291123 -0.197563 -0.160115 -0.144835 0.341108 -0.000015 -0.140836 -0.170352 -0.101162 0.277679 0.146286
polarizability: 2.56891596e+02 -7.23042905e+00 1.69804310e+02 1.67497033e+01 4.05371038e+00 8.56123361e+01
1716.lowfreq: -6.5950 -0.0007 -0.0004 0.0004 6.2306 9.9512 11.7214 28.6416 36.4933
frequency: 11.2885 28.6097 36.2554 44.4953 81.5073 111.0017 173.8731 198.6508 215.6353 255.8455 263.8989 289.0253 332.5481 350.8035 369.1816 403.9083 410.8024 442.5505 452.3178 473.2581 510.7024 547.7391 568.9042 615.8917 636.9845 696.3654 714.7884 718.9139 764.9354 784.4534 790.1198 806.3014 825.3083 839.2797 870.4472 887.0715 901.8907 930.6055 959.6775 964.3687 980.0921 986.1164 1000.9019 1005.2649 1021.4019 1084.9248 1101.0660 1112.9375 1139.9899 1144.1623 1144.9785 1163.9057 1177.9715 1185.5457 1215.6372 1245.8652 1251.3492 1268.2687 1272.7211 1301.3316 1317.2813 1325.2220 1388.7600 1390.8227 1425.2735 1432.2296 1448.0070 1465.6688 1472.9144 1475.2385 1477.8036 1487.9233 1504.7618 1588.3288 1597.6752 1620.1296 1626.7390 2957.2422 2985.3183 2994.5043 3033.5981 3044.3223 3060.7956 3107.2202 3120.3566 3122.2299 3122.5073 3133.6288 3140.9658 3144.7428 3166.1107 3168.5630 3583.0234
redmass: 3.8774 4.6876 3.2334 4.6534 3.9404 4.4360 5.6324 1.6578 2.8199 4.0031 1.8626 2.5316 3.1240 1.1044 5.0504 3.2098 2.9694 4.0841 3.2387 5.5086 3.0146 4.2127 3.7839 5.2324 6.7515 2.1954 4.1513 4.2114 2.6515 1.4194 1.5188 1.4831 2.2127 2.2868 1.5911 1.8400 2.3172 1.4175 1.3695 1.3263 3.4755 2.6243 4.0449 3.0123 2.8033 1.5983 1.4265 1.2598 1.2646 1.4981 1.2569 1.3972 1.1078 1.2218 2.2507 2.8802 2.5058 1.2815 1.6390 1.2860 1.2852 1.3577 7.6573 6.3920 2.8274 1.3334 2.1268 1.0503 1.2287 1.0946 2.0271 1.1010 2.7853 6.1360 6.4412 6.6959 6.4831 1.0330 1.0592 1.0598 1.1011 1.1038 1.1049 1.0873 1.0866 1.0899 1.0991 1.0962 1.0926 1.0924 1.0961 1.0951 1.0660
irintensity: 0.5914 0.1191 0.2283 1.1782 4.0052 2.4654 0.2633 0.8534 3.5235 0.1353 1.2225 2.2863 3.2979 145.0568 1.1852 9.4325 1.8375 0.9159 2.6241 10.1190 24.9247 11.8100 13.9648 1.9379 0.8573 29.4229 6.6148 3.6511 17.1242 17.6602 33.7378 29.3483 14.8258 27.7002 4.3325 16.3491 8.5436 0.2220 0.1020 0.3335 4.6215 3.2513 0.4543 8.4273 71.4991 8.5084 34.4536 0.2436 131.8411 35.7977 110.6823 51.3685 6.5094 5.6265 3.0524 28.4576 106.0853 6.5821 12.2060 0.6673 11.5126 1.7950 1.8347 20.8100 14.8049 24.5967 28.3590 12.8432 6.1192 21.4827 47.0441 11.7486 110.8499 57.5148 9.3905 111.2138 23.4892 73.7221 0.5243 63.2541 0.0773 51.2279 27.1586 22.2908 6.2215 17.7640 28.9819 14.8663 25.6796 3.8499 17.1653 6.8702 39.5104
temp: 298.150 k
press: 1.00000 atm
elementType: 8 8 6 6 6 6 6 6 6 6 6 6 6 6 6 6 6 1 1 1 1 1 1 1 1 1 1 1 1 1 1 1 1
symmnumber: 1
zpe: 705883.7 jmol-1
zpe.correction: 0.268857 hartree
zpe.thermalcorrener: 0.284764 hartree
zpe.thermalcorrenthalpy: 0.285708 hartree
zpe.thermalcorrgfe: 0.222538 hartree
zpe.sumelectzpe: -730.397128 hartree
zpe.sumelectthermal: -730.381220 hartree
zpe.sumelectthermalent: -730.380276 hartree
zpe.sumelectthermalfe: -730.443447 hartree
dipole: 1.4837 2.1461 0.4435
dipole: 2.6465
quadrupole: -76.3199 -93.7569 -106.9913
quadrupole: -11.7005 4.2367 -0.1467
quadrupole: 16.0361 -1.4008 -14.6353 -11.7005 4.2367 -0.1467
hfenergy: -730.6659847 hartree
pointgroup: C01 [X(C15H16O2)]
dipole: 0.59282 -0.8339998 -0.192708 debye
polarizability: 256.4382809|8.6314651|169.8488934|-17.9372304|5.169188|86.0210681 unknown
InChI: InChI=1S/C15H16O2/c1-17-15-4-2-3-13(11-15)6-5-12-7-9-14(16)10-8-12/h2-4,7-11,16H,5-6H2,1H3
charge 0 multiplicity 1
33 atoms
O  4.571436 1.652263 0.030301
O  -6.333814 0.505772 0.3955
C  0.108432 -0.335636 0.662017
C  -0.70533 -0.225428 -0.670579
C  1.598103 -0.510685 0.41047
C  -2.195859 -0.052783 -0.425805
C  2.45202 0.611877 0.34685
C  2.148191 -1.803901 0.190031
C  -3.062981 -1.171955 -0.363689
C  -2.756943 1.234314 -0.208345
C  3.831857 0.456905 0.064626
C  3.521645 -1.95438 -0.088538
C  4.379279 -0.83065 -0.156064
C  -4.441464 -1.021952 -0.092315
C  -4.128863 1.405791 0.063409
C  -4.971645 0.272362 0.122754
C  6.00408 1.55192 -0.25322
H  -0.288195 -1.191071 1.241728
H  -0.080104 0.574512 1.26205
H  -0.513923 -1.134699 -1.271619
H  -0.305128 0.62901 -1.249173
H  2.067638 1.623509 0.518666
H  1.498891 -2.685763 0.245817
H  -2.658634 -2.177179 -0.535534
H  -2.109395 2.118529 -0.259276
H  3.939724 -2.954339 -0.252384
H  5.44284 -0.969611 -0.371432
H  -5.095313 -1.903593 -0.054105
H  -4.562406 2.397084 0.226178
H  6.188106 1.112075 -1.253094
H  6.527532 0.951834 0.516762
H  6.37465 2.587412 -0.230612
H  -6.837227 -0.345546 0.415826
