program: Gaussian 09
title: 000173534
version: EM64L-G09RevD.01
frameworkgroup: C1[X(C11H20O2)]
method: RPBEPBE
basis: SDD
operation: Freq
keyword: #pfreq=noraman
keyword: PBEPBE/SDD
title: #p freq=noraman PBEPBE/SDD
converged: YES YES NO NO
title: Mulliken charges:
elementType: O O C C C C C C C C C C C H H H H H H H H H H H H H H H H H H H H
charge: -0.262284 -0.248345 -0.337686 -0.368521 -0.355439 -0.513051 -0.693743 0.250488 -0.342919 -0.310668 0.400381 -0.779520 -0.786351 0.186740 0.184578 0.224284 0.202344 0.196222 0.198400 0.245145 0.234723 0.209526 0.209069 0.216763 0.236422 0.224053 0.228753 0.218751 0.221947 0.232056 0.225756 0.228923 0.223202
chargesum: 0.00000
title: Mulliken charges with hydrogens summed into heavy atoms:
elementType: O O C C C C C C C C C C C
charge: -0.262284 -0.248345 0.033632 0.058107 0.039183 -0.033183 -0.058385 0.250488 0.117556 -0.081915 0.400381 -0.106766 -0.108470
polarizability: 1.83682896e+02 -9.32970548e+00 1.09415513e+02 1.03028008e+01 1.78577643e+00 1.04060703e+02
1716.lowfreq: -11.8958 -7.0286 0.0006 0.0008 0.0009 1.5805 12.4086 18.6154 28.2621
frequency: 12.2999 17.5719 27.3784 39.9028 49.5258 97.4542 103.7567 113.5280 117.1978 164.2317 173.8631 189.3673 230.3386 235.5851 254.5497 291.6194 348.3360 392.3835 405.8635 447.3397 490.3324 516.0356 570.4935 678.2255 723.9524 751.9583 777.5329 818.1849 837.7508 878.2145 885.8763 917.0193 947.9597 953.8835 970.8739 992.7058 1011.4896 1039.5912 1064.0023 1075.0378 1084.0080 1094.6744 1113.3239 1137.4747 1143.4408 1185.9256 1198.0172 1233.1895 1241.2646 1254.4450 1284.2751 1289.0904 1305.7623 1325.2025 1349.9149 1358.5695 1372.1144 1387.7829 1390.2802 1400.6722 1442.1052 1454.0062 1459.4051 1464.5445 1469.7880 1471.3577 1472.1184 1476.7846 1480.0322 1480.7668 1488.3294 1634.0546 1697.7010 2952.0769 2962.8218 2968.7794 2970.6590 2971.7332 2976.4473 2988.8895 2993.9347 3006.9876 3022.5388 3035.7126 3040.8734 3043.3709 3065.8714 3069.6568 3071.5938 3076.3456 3084.6130 3096.6864 3109.4078
redmass: 3.4001 4.1594 2.0885 3.1552 3.1323 2.4307 1.9755 2.0427 1.1656 2.4367 1.6374 2.9489 1.1171 3.0610 4.3235 2.3563 3.1367 2.7901 2.7297 2.5485 2.9026 2.8650 3.1445 4.7112 1.0862 1.1909 2.6018 2.3034 1.3199 2.4199 2.6958 2.8259 1.3903 1.2423 1.8355 1.2596 4.0117 1.7683 2.9045 2.1765 1.6903 1.8664 2.2314 2.5691 2.3549 1.2758 1.5427 1.8270 1.3344 1.2663 1.0680 1.1326 1.3517 1.3941 1.5683 1.6682 1.5352 1.2173 1.3087 1.2216 1.0846 1.0515 1.0631 1.0689 1.0715 1.0782 1.0464 1.0431 1.0718 1.0844 1.0879 9.8889 6.4193 1.0589 1.0373 1.0585 1.0386 1.0370 1.0657 1.0664 1.0926 1.0604 1.1017 1.0968 1.0963 1.0979 1.0995 1.1003 1.0992 1.1018 1.0989 1.0956 1.0913
irintensity: 0.5864 0.6321 0.2661 0.5540 0.5178 0.1852 0.1722 0.0831 0.1837 4.1507 2.1980 0.8858 0.0009 1.2117 14.6196 2.5007 0.3661 2.1232 3.0006 3.3160 16.8189 5.3313 0.9874 2.6678 14.0518 0.3640 6.9492 5.4837 2.2939 12.4158 89.9466 35.1391 0.4589 2.1189 9.1619 8.2998 38.3342 35.2432 19.6164 28.7597 4.8490 110.7144 4.8536 160.4846 111.8393 5.5056 4.1089 7.3065 44.2667 9.3032 0.1575 2.0956 37.9624 2.1336 10.2480 14.0618 5.4942 10.5119 28.3444 12.2852 18.5060 1.6294 1.5231 0.1504 0.6909 11.1855 29.9322 12.3464 7.2455 17.2742 21.8313 199.1311 18.0848 14.1781 33.0758 50.7258 44.5404 32.4757 1.6085 41.7502 10.1409 16.5913 17.2900 8.6217 40.3536 11.9028 0.8176 130.4184 53.3885 11.6702 23.9327 26.9162 36.9498
temp: 298.150 k
press: 1.00000 atm
elementType: 8 8 6 6 6 6 6 6 6 6 6 6 6 1 1 1 1 1 1 1 1 1 1 1 1 1 1 1 1 1 1 1 1
symmnumber: 1
zpe: 752227.6 jmol-1
zpe.correction: 0.286508 hartree
zpe.thermalcorrener: 0.303576 hartree
zpe.thermalcorrenthalpy: 0.304521 hartree
zpe.thermalcorrgfe: 0.237400 hartree
zpe.sumelectzpe: -580.552490 hartree
zpe.sumelectthermal: -580.535422 hartree
zpe.sumelectthermalent: -580.534478 hartree
zpe.sumelectthermalfe: -580.601599 hartree
dipole: 1.4783 -1.7447 0.3950
dipole: 2.3206
quadrupole: -66.4888 -87.5713 -78.2107
quadrupole: 1.0974 2.0784 1.4021
quadrupole: 10.9348 -10.1477 -0.7871 1.0974 2.0784 1.4021
hfenergy: -580.8389987 hartree
pointgroup: C01 [X(C11H20O2)]
dipole: 0.5819179 0.619584 -0.3332722 debye
polarizability: 183.5687909|6.0234289|109.9026445|-12.8973152|0.1993781|103.687677 unknown
InChI: InChI=1S/C11H20O2/c1-4-5-6-7-11(12)13-9-8-10(2)3/h8H,4-7,9H2,1-3H3
charge 0 multiplicity 1
33 atoms
O  0.905352 0.156696 0.297164
O  -0.355475 -1.701958 0.927259
C  -4.012666 0.617938 -0.033027
C  -2.792421 -0.32655 0.025521
C  -5.32877 -0.121395 -0.366695
C  -1.481767 0.42621 0.337667
C  -6.552105 0.819412 -0.41121
C  -0.299544 -0.506416 0.553655
C  2.161981 -0.645567 0.543189
C  3.306746 0.320924 0.583189
C  4.39331 0.343742 -0.242597
C  5.490101 1.376429 -0.042063
C  4.632163 -0.615356 -1.395114
H  -3.838242 1.410951 -0.790402
H  -4.124811 1.137997 0.941834
H  -2.951871 -1.106359 0.794004
H  -2.688744 -0.860732 -0.939744
H  -5.219473 -0.636029 -1.343075
H  -5.498488 -0.917553 0.386336
H  -1.224966 1.14994 -0.456353
H  -1.605384 1.019894 1.267409
H  -6.7032 1.319367 0.564252
H  -6.417569 1.609122 -1.174628
H  -7.478745 0.268071 -0.655176
H  2.024778 -1.178976 1.502797
H  2.242636 -1.399991 -0.256943
H  3.240913 1.073202 1.38158
H  6.469909 0.887997 0.12913
H  5.604705 2.006425 -0.946253
H  5.280851 2.038442 0.815376
H  5.526301 -1.240748 -1.202377
H  3.783871 -1.291044 -1.589479
H  4.836627 -0.050285 -2.325326
