program: Gaussian 09
title: 000173513
version: EM64L-G09RevD.01
frameworkgroup: C1[X(C16H14O5)]
method: RPBEPBE
basis: SDD
operation: Freq
keyword: #pfreq=noraman
keyword: PBEPBE/SDD
title: #p freq=noraman PBEPBE/SDD
converged: YES YES NO NO
title: Mulliken charges:
elementType: O O O O O C C C C C C C C C C C C C C C C H H H H H H H H H H H H H H
charge: -0.246904 -0.197940 -0.265807 -0.426667 -0.472133 -0.381150 -0.363183 0.064067 0.528413 0.225798 0.243865 -0.424797 -0.375075 -0.497340 -0.509011 0.147504 0.197431 -0.356023 -0.372065 0.315771 -0.538317 0.264980 0.247433 0.221221 0.232061 0.242623 0.300092 0.253512 0.249576 0.239770 0.383554 0.380289 0.223996 0.244918 0.219538
chargesum: 0.00000
title: Mulliken charges with hydrogens summed into heavy atoms:
elementType: O O O O O C C C C C C C C C C C C C C C C
charge: -0.246904 -0.197940 -0.265807 -0.043113 -0.091844 -0.116171 0.105471 0.064067 0.528413 0.225798 0.243865 -0.192736 -0.132452 -0.197248 -0.255499 0.147504 0.197431 -0.106447 -0.132295 0.315771 0.150135
polarizability: 3.23600783e+02 -8.10640771e+00 1.67029449e+02 -5.61692835e+00 -5.88439535e+00 1.13130660e+02
1716.lowfreq: -7.5804 -2.3624 -0.0006 -0.0005 0.0002 2.1272 25.3934 28.9969 42.4078
frequency: 25.3642 28.9569 42.4026 88.7985 99.6164 115.0730 151.4201 167.6184 198.2715 208.3687 228.7746 250.1500 259.9409 262.6916 284.8028 324.5785 345.0219 373.7391 377.4527 413.6783 419.9773 422.3547 445.0859 455.0748 459.2909 480.5340 525.2495 541.9854 578.1911 606.8902 629.7136 643.1574 689.7402 694.7371 721.6083 731.2481 745.1228 768.6069 795.0152 813.9047 831.0598 831.6483 845.1311 910.6882 930.0715 940.2336 957.0287 961.2801 988.3698 1003.1839 1028.5040 1066.4676 1089.4261 1113.4042 1113.8246 1141.0069 1156.7361 1159.1082 1177.6720 1181.5401 1195.7140 1198.5645 1213.5178 1233.3596 1259.2044 1270.9490 1299.2862 1310.7533 1318.7048 1366.7169 1384.3718 1416.7383 1420.2940 1437.7640 1450.1448 1464.3287 1467.8344 1473.1529 1503.4601 1505.0266 1582.3645 1585.5330 1591.2584 1625.3243 1641.5816 2959.1374 2960.8866 2986.4484 3047.0277 3107.6644 3118.7991 3124.8230 3143.7039 3150.1989 3165.6864 3169.0039 3173.6357 3535.2072 3617.2549
redmass: 7.1544 4.1907 4.8576 6.1206 4.3461 5.0851 5.3063 4.1895 6.0566 4.3922 2.3030 2.1142 4.8438 2.5516 5.1342 1.1816 5.6576 6.4444 7.0965 2.9435 6.7579 4.1535 1.5242 4.0230 1.9936 7.4822 3.6144 3.2960 5.7199 5.8699 6.7704 5.5493 5.3615 5.8261 4.1491 3.5667 3.9300 5.4527 3.7876 1.3409 1.5587 1.6673 4.8957 1.4343 2.6875 1.6397 3.5168 1.3636 8.3513 2.6943 2.4488 4.4050 2.0362 1.3515 1.2664 1.6385 1.4136 2.0164 2.0396 1.2750 1.3916 1.3818 1.7438 2.9842 2.4648 1.8051 1.5224 1.4489 2.0472 1.6944 4.4262 5.3346 3.2786 1.1688 3.4330 1.2269 1.0497 1.0734 2.7021 3.4519 8.4919 8.5910 8.0353 6.4174 7.7014 1.0333 1.0794 1.0677 1.1040 1.0993 1.0897 1.0993 1.0880 1.0923 1.0944 1.0955 1.0921 1.0650 1.0666
irintensity: 1.4793 1.1154 2.5780 0.6319 1.6729 5.6956 1.6738 3.2271 3.5628 2.5001 0.4412 0.3418 3.5687 0.7545 6.8456 168.4943 10.8029 0.7780 10.0904 0.4433 4.6292 0.7709 123.2166 4.7220 25.0271 2.2363 49.8954 49.6415 3.3740 23.7093 1.7173 0.6776 1.8452 20.0545 1.0892 7.6216 0.2258 30.2340 23.0132 12.5246 53.9988 26.0076 16.1138 22.5087 20.5070 3.2676 41.6982 0.2121 46.9300 12.9478 14.6435 12.0023 358.8639 13.2989 1.1103 106.8077 3.3887 26.4688 0.2358 88.2482 5.7420 33.7056 44.4347 163.4254 460.6815 77.7371 15.0783 21.5779 128.6590 23.1557 15.7864 32.6229 1.5060 11.6527 24.6196 6.5538 13.3497 62.5740 311.2878 103.3162 83.8655 92.1319 134.6151 37.0494 74.1233 70.2027 1.0771 52.4312 48.3343 16.2830 15.2461 29.1606 13.9755 3.5975 13.7015 3.5663 7.1991 97.4096 94.5533
temp: 298.150 k
press: 1.00000 atm
elementType: 8 8 8 8 8 6 6 6 6 6 6 6 6 6 6 6 6 6 6 6 6 1 1 1 1 1 1 1 1 1 1 1 1 1 1
symmnumber: 1
zpe: 695724.3 jmol-1
zpe.correction: 0.264987 hartree
zpe.thermalcorrener: 0.283447 hartree
zpe.thermalcorrenthalpy: 0.284391 hartree
zpe.thermalcorrgfe: 0.217729 hartree
zpe.sumelectzpe: -992.695422 hartree
zpe.sumelectthermal: -992.676962 hartree
zpe.sumelectthermalent: -992.676018 hartree
zpe.sumelectthermalfe: -992.742681 hartree
dipole: 1.3742 -3.4944 -2.7644
dipole: 4.6628
quadrupole: -88.9745 -124.3342 -119.5756
quadrupole: -20.7691 3.7272 -6.2632
quadrupole: 21.9869 -13.3728 -8.6142 -20.7691 3.7272 -6.2632
hfenergy: -992.9604097 hartree
pointgroup: C01 [X(C16H14O5)]
dipole: 0.5469894 -1.5355158 -0.8416129 debye
polarizability: 323.6034542|-9.3836209|163.8022184|-1.1120056|-14.337929|116.3552192 unknown
InChI: InChI=1S/C16H14O5/c1-20-10-4-2-9(3-5-10)12-8-21-15-7-14(18)13(17)6-11(15)16(12)19/h2-7,12,17-18H,8H2,1H3
charge 0 multiplicity 1
35 atoms
O  1.464041 -2.110569 -0.067498
O  0.123429 1.865058 0.394329
O  -6.083642 0.128423 -0.210931
O  5.25016 2.052853 -0.145006
O  6.066341 -0.513731 -0.341278
C  -0.407603 -0.543779 0.55191
C  0.056641 -1.722974 -0.336999
C  0.52505 0.668415 0.31331
C  -1.892823 -0.288842 0.342904
C  1.946649 0.320831 0.059081
C  2.363757 -1.038034 -0.069627
C  -2.841909 -0.89068 1.211043
C  -2.374592 0.477396 -0.744626
C  2.930638 1.350188 0.021612
C  3.731933 -1.366832 -0.199455
C  4.285085 1.040492 -0.11611
C  4.67765 -0.330181 -0.216119
C  -4.224274 -0.737928 1.003555
C  -3.759021 0.644171 -0.969399
C  -4.688281 0.032034 -0.091979
C  -6.613995 0.936999 -1.310934
H  -0.239374 -0.846551 1.608348
H  -0.529312 -2.632224 -0.134678
H  -0.03311 -1.456008 -1.410073
H  -2.493621 -1.481657 2.06762
H  -1.666824 0.981594 -1.410899
H  2.609235 2.390664 0.123237
H  4.019295 -2.418995 -0.29913
H  -4.958487 -1.194268 1.674173
H  -4.095642 1.253605 -1.813345
H  6.149167 1.641812 -0.239322
H  6.318541 -1.466855 -0.390914
H  -6.282006 1.990604 -1.232736
H  -7.707463 0.883979 -1.204992
H  -6.314331 0.526291 -2.295074
