program: Gaussian 09
title: 000172941
version: EM64L-G09RevD.01
frameworkgroup: C1[X(C17H30O)]
method: RPBEPBE
basis: SDD
operation: Freq
keyword: #pfreq=noraman
keyword: PBEPBE/SDD
title: #p freq=noraman PBEPBE/SDD
converged: YES YES NO NO
title: Mulliken charges:
elementType: O C C C C C C C C C C C C C C C C C H H H H H H H H H H H H H H H H H H H H H H H H H H H H H H
charge: -0.476397 0.324374 0.371692 -0.133409 -0.212053 -0.569909 -0.571379 -0.490404 0.234431 -0.854440 -0.809065 -0.798954 -0.108627 -0.508293 -0.426228 -0.387141 -0.411884 -0.787987 0.222029 0.240876 0.245564 0.173958 0.267755 0.217378 0.232191 0.190426 0.225550 0.203966 0.229679 0.211993 0.238676 0.212190 0.211848 0.238586 0.214256 0.216392 0.225016 0.202418 0.181938 0.234465 0.205851 0.188026 0.315221 0.195572 0.198903 0.215926 0.242635 0.216390
chargesum: 0.00000
title: Mulliken charges with hydrogens summed into heavy atoms:
elementType: O C C C C C C C C C C C C C C C C C
charge: -0.161176 0.324374 0.371692 0.088619 0.028823 -0.150387 -0.086246 -0.067788 0.234431 -0.195245 -0.146205 -0.134264 0.107765 -0.080858 -0.009826 0.006736 -0.017410 -0.113036
polarizability: 2.04797642e+02 -6.71663014e-02 1.66847341e+02 -1.86199592e-02 -7.12371847e-01 1.55926350e+02
1716.lowfreq: -10.1870 0.0003 0.0005 0.0010 16.2182 20.1239 58.0950 92.2710 114.2541
frequency: 57.9071 92.0903 114.2215 137.1801 154.0440 169.6291 198.2151 201.2695 215.9383 234.9010 246.9226 256.0421 281.1247 290.5119 294.9726 306.0470 311.5069 320.8667 346.1754 366.3758 380.2129 395.6153 423.1636 438.1537 442.5325 474.4488 486.4070 510.7607 546.7450 567.7635 581.3661 631.4859 653.4686 700.0527 728.4072 769.7881 794.6411 810.0505 828.5185 845.7053 860.4644 875.6757 879.3829 906.3048 921.6341 931.5106 937.9616 945.2371 947.9537 952.4515 971.3421 989.0346 994.9491 1002.9298 1008.2030 1033.0244 1038.0832 1067.3768 1070.5005 1082.2723 1085.3504 1099.7127 1123.1971 1130.1681 1147.5962 1153.4641 1157.8605 1161.6758 1184.8654 1200.4012 1206.6481 1215.5947 1232.7634 1240.6389 1244.4655 1264.0001 1266.0802 1266.8874 1291.3443 1298.1664 1298.6957 1305.0846 1309.9513 1317.8216 1331.7938 1339.1772 1343.1838 1352.3127 1369.7484 1380.4765 1386.7090 1391.7051 1400.5884 1453.2759 1456.7144 1461.3292 1462.9062 1463.4378 1475.5487 1477.2484 1479.3462 1482.7848 1484.3305 1489.0426 1489.5168 1497.0666 1502.0631 1505.1842 2963.1273 2969.8461 2972.9352 2973.8639 2975.3721 2978.8264 2981.9425 2983.6689 2987.3383 2988.2083 2993.1518 3001.7711 3004.4866 3023.8531 3026.2412 3032.6511 3040.8828 3043.9425 3050.7450 3051.7306 3057.4338 3058.3904 3059.1116 3076.2626 3079.3550 3085.7429 3093.7019 3097.5086 3101.8247 3546.8178
redmass: 3.1426 2.7868 2.8691 1.8784 1.2945 1.4785 2.6054 2.1029 1.4160 2.1364 2.4881 1.8540 1.2587 2.4851 2.3288 1.6214 2.3407 1.9713 2.4740 1.9307 2.1722 2.4361 1.9921 2.5612 2.9254 2.4166 2.3457 2.8144 3.1955 3.6423 3.5984 2.7337 2.6204 3.1654 2.5895 2.4523 1.5741 2.0393 2.0610 2.0482 2.4901 1.6531 2.2669 2.4039 2.0784 1.8443 1.4889 1.7638 1.7221 1.8395 2.1919 1.6933 1.5163 1.6294 1.9866 1.6673 2.0703 2.0051 1.6243 1.3007 1.6555 1.3377 1.8298 1.6528 2.2223 2.0987 1.7799 2.2016 1.4602 1.8765 1.8672 1.9949 1.8796 1.4312 1.5295 1.3210 1.2869 2.0233 1.4649 1.4602 1.4931 1.5179 1.6893 1.7490 1.4250 1.4324 1.3943 1.4423 1.4420 1.2277 1.2232 1.2145 1.1969 1.0834 1.0795 1.0650 1.0708 1.0619 1.0624 1.0693 1.0609 1.0684 1.0580 1.0669 1.0696 1.0629 1.0561 1.0744 1.0671 1.0601 1.0604 1.0377 1.0370 1.0386 1.0631 1.0673 1.0748 1.0633 1.0429 1.0808 1.0706 1.0976 1.0991 1.0921 1.0956 1.1021 1.0982 1.0968 1.0975 1.0981 1.0985 1.0963 1.0965 1.0967 1.0958 1.0962 1.0967 1.0649
irintensity: 0.1753 0.0406 0.2194 0.1360 0.2514 0.6881 0.5898 0.5020 0.0235 0.0862 0.3828 1.7546 3.1001 0.6276 9.5638 47.8123 1.0036 128.3371 3.9801 1.3834 2.7485 1.2664 0.4053 2.2760 5.0250 1.6978 1.7605 0.1162 3.1020 0.8002 0.0397 0.6011 8.0452 0.1588 1.0854 6.9721 5.9142 2.7772 0.6369 4.5481 12.9232 6.5268 8.7417 4.7868 14.6151 6.6611 4.2202 10.8609 3.2692 2.2186 6.5328 4.6795 2.0918 5.1768 2.5110 1.5100 1.9636 8.6276 7.0310 1.6103 15.6579 2.4666 2.5830 16.5467 15.0207 1.6073 9.2061 7.3217 4.0141 2.4971 2.2301 5.8067 0.6874 8.7587 3.9108 2.6815 1.0196 0.5811 7.7908 6.0421 8.0873 6.5087 0.4031 1.7703 3.5531 1.7947 3.3471 0.1544 15.4735 14.1487 11.6563 20.2800 32.1536 4.8310 9.1238 9.3523 3.0671 5.3077 2.3485 11.0628 10.9831 12.3826 18.6955 1.8946 15.9596 11.2569 6.2753 10.6784 60.5405 14.5037 22.0024 21.6470 23.9812 57.7686 68.9622 40.5139 34.6387 35.4258 52.2362 33.2718 47.0282 59.7319 31.5052 31.5970 43.5262 38.1728 8.9625 44.0931 72.4612 53.5466 62.7816 26.6546 32.5444 46.6130 39.0760 6.2497 28.3790 0.5876
temp: 298.150 k
press: 1.00000 atm
elementType: 8 6 6 6 6 6 6 6 6 6 6 6 6 6 6 6 6 6 1 1 1 1 1 1 1 1 1 1 1 1 1 1 1 1 1 1 1 1 1 1 1 1 1 1 1 1 1 1
symmnumber: 1
zpe: 1142434.8 jmol-1
zpe.correction: 0.435130 hartree
zpe.thermalcorrener: 0.453490 hartree
zpe.thermalcorrenthalpy: 0.454434 hartree
zpe.thermalcorrgfe: 0.392246 hartree
zpe.sumelectzpe: -739.564351 hartree
zpe.sumelectthermal: -739.545991 hartree
zpe.sumelectthermalent: -739.545047 hartree
zpe.sumelectthermalfe: -739.607235 hartree
dipole: -0.8751 -0.1960 1.3846
dipole: 1.6496
quadrupole: -114.6595 -111.3848 -116.1269
quadrupole: 1.0021 1.8480 -0.9700
quadrupole: -0.6025 2.6723 -2.0698 1.0021 1.8480 -0.9700
hfenergy: -739.999481 hartree
pointgroup: C01 [X(C17H30O1)]
dipole: 0.3521274 0.093926 0.537035 debye
polarizability: 204.7875591|-0.2445049|166.8846559|-0.6474394|0.3428205|155.899119 unknown
InChI: InChI=1S/C17H30O/c1-12-7-5-6-9-17(12,18)14-11-13-8-10-16(14,4)15(13,2)3/h12-14,18H,5-11H2,1-4H3
charge 0 multiplicity 1
48 atoms
O  -1.285923 1.123083 -1.220835
C  1.369768 -0.640719 -0.364524
C  2.68979 -0.168633 0.410213
C  0.24922 0.079954 0.503565
C  2.358433 1.350285 0.22961
C  0.943577 1.457624 0.860616
C  1.526228 0.12272 -1.721951
C  2.192577 1.486179 -1.314244
C  -1.230757 0.264229 0.001551
C  1.266424 -2.163224 -0.531033
C  4.014241 -0.602657 -0.266708
C  2.781909 -0.624589 1.889481
C  -1.958717 -1.045165 -0.44805
C  -2.062573 0.970387 1.120406
C  -3.411815 -0.717631 -0.904168
C  -3.5178 1.264357 0.684356
C  -4.23857 -0.013697 0.197448
C  -1.965316 -2.155633 0.632016
H  0.149284 -0.505902 1.438826
H  3.09374 2.049112 0.666425
H  0.9877 1.614816 1.953019
H  0.408826 2.33669 0.446764
H  0.553424 0.262184 -2.216152
H  2.174165 -0.452749 -2.408756
H  3.167489 1.632026 -1.812918
H  1.565405 2.35966 -1.576807
H  2.166503 -2.547087 -1.047592
H  1.194406 -2.683029 0.442902
H  0.39393 -2.462406 -1.136084
H  4.198032 -1.682714 -0.111577
H  4.03842 -0.412117 -1.351726
H  4.863762 -0.057195 0.187236
H  3.704429 -0.223617 2.351215
H  1.934022 -0.297137 2.513049
H  2.837815 -1.728134 1.951533
H  -1.415286 -1.423618 -1.335566
H  -1.565833 1.916891 1.409506
H  -2.064092 0.330429 2.025767
H  -3.909698 -1.658176 -1.214174
H  -3.36143 -0.05879 -1.789712
H  -3.500599 2.001484 -0.141634
H  -4.070826 1.726641 1.52569
H  -0.804892 1.967006 -1.023035
H  -4.401023 -0.699434 1.053428
H  -5.242367 0.24289 -0.193409
H  -2.476641 -3.052562 0.235293
H  -0.950026 -2.458139 0.933845
H  -2.507032 -1.846693 1.543497
