program: Gaussian 09
title: 000171892
version: EM64L-G09RevD.01
frameworkgroup: C1[X(C9H4N2O2)]
method: RPBEPBE
basis: SDD
operation: Freq
keyword: #pfreq=noraman
keyword: PBEPBE/SDD
title: #p freq=noraman PBEPBE/SDD
converged: NO NO NO NO
title: Mulliken charges:
elementType: O O N N C C C C C C C C C H H H H
charge: -0.160996 -0.164146 0.104846 0.084215 -0.542730 0.055134 0.218712 0.058682 -0.351906 0.229136 -0.332869 -0.094904 -0.111309 0.252613 0.253091 0.246955 0.255475
chargesum: 0.00000
title: Mulliken charges with hydrogens summed into heavy atoms:
elementType: O O N N C C C C C C C C C
charge: -0.160996 -0.164146 0.104846 0.084215 -0.037026 0.055134 0.218712 0.058682 -0.104951 0.229136 -0.077395 -0.094904 -0.111309
polarizability: 1.90447194e+02 4.62859306e+00 1.37524795e+02 3.19358514e-01 -3.89526970e-01 4.60152288e+01
1716.lowfreq: -58.7699 -14.5231 -0.0007 -0.0005 0.0003 10.7562 13.0464 13.8051 58.2223
frequency: -58.7592 -14.4543 58.2102 83.8137 167.5730 179.3170 278.6565 304.1088 321.2736 384.6581 466.6245 473.4267 485.3139 490.4407 491.8091 499.4550 537.6254 548.8154 659.9379 724.6413 777.3995 829.7911 926.2534 939.1145 983.0873 989.5685 1048.8992 1084.1469 1106.4015 1133.7220 1168.8042 1338.9565 1355.2462 1421.0683 1457.6595 1508.7279 1546.2749 1583.4267 1715.0172 2373.7372 2398.4882 3039.8290 3133.8353 3150.2463 3171.3982
redmass: 9.7828 14.5407 6.1862 8.4934 3.7658 8.0623 10.2778 7.0166 5.3108 7.0951 10.4007 9.7244 12.1102 6.2827 10.4205 9.6264 4.3867 5.3885 7.0076 5.3214 8.8337 1.3561 6.0237 1.3636 1.1839 1.3000 6.7651 1.2611 3.5551 1.9774 2.1868 4.8867 2.6104 3.9694 1.1326 8.7259 9.1201 10.4462 10.6286 12.7473 12.7440 1.0530 1.1154 1.0885 1.0981
irintensity: 0.3237 0.0509 0.0465 0.2378 7.5439 1.8975 2.9128 1.7147 2.1944 6.6314 12.3910 11.6539 29.1815 6.3443 5.5235 4.2043 2.6038 12.3700 2.8631 4.8103 23.9768 47.8860 24.7635 1.0028 0.6469 0.9105 65.2153 18.7571 17.8571 31.4392 21.3615 37.9488 10.9170 48.2044 5.3936 0.7475 15.9256 25.8105 30.6940 974.0428 1959.5617 55.3667 12.9057 3.6446 12.2645
temp: 298.150 k
press: 1.00000 atm
elementType: 8 8 7 7 6 6 6 6 6 6 6 6 6 1 1 1 1
symmnumber: 1
zpe: 283136.9 jmol-1
zpe.correction: 0.107841 hartree
zpe.thermalcorrener: 0.117579 hartree
zpe.thermalcorrenthalpy: 0.118523 hartree
zpe.thermalcorrgfe: 0.071741 hartree
zpe.sumelectzpe: -604.336110 hartree
zpe.sumelectthermal: -604.326372 hartree
zpe.sumelectthermalent: -604.325428 hartree
zpe.sumelectthermalfe: -604.372210 hartree
dipole: -5.2935 -1.2071 0.2105
dipole: 5.4335
quadrupole: -80.6317 -75.1544 -71.9204
quadrupole: -1.7428 -0.5883 -0.1615
quadrupole: -4.7296 0.7478 3.9818 -1.7428 -0.5883 -0.1615
hfenergy: -604.4439512 hartree
pointgroup: C01 [X(C9H4N2O2)]
dipole: -1.8367767 1.0919889 -0.060171 debye
dipolederiv: -0.6072191 0.7408687 0.2394292 0.5880007 -1.4574495 -0.3790335 0.1800414 -0.3604821 -0.3750876 -1.8689568 -0.1039824 -0.3993367 0.0653321 -0.2472082 0.021064 -0.3878996 -0.0213332 -0.3572361 -0.7493988 0.882299 0.2522907 0.7796365 -1.7651996 -0.493107 0.224461 -0.4789179 -0.3522888 -2.1583184 -0.0840678 -0.4977194 0.0705237 -0.2625807 -0.0154296 -0.4237467 -0.0473125 -0.3019284 0.1912178 0.0382249 -0.0098944 0.0654874 0.1347412 -0.0533456 -0.0778513 -0.0742516 0.2458454 -0.4236692 0.2230963 0.0189121 0.4001527 -0.2717154 0.0753953 0.1643624 0.0266222 -0.0819456 0.0672717 0.0567069 0.1005079 -0.2102452 -0.2788311 -0.1401146 0.0778901 -0.0491216 -0.1216295 0.5304175 -0.5597494 -0.1592956 -0.6099191 1.2072164 0.3068185 -0.2220405 0.3271462 0.2310671 0.0702906 -0.0269781 0.0266648 0.0093827 0.1503546 0.1001901 0.0002097 0.0896961 -0.0899617 1.2124165 0.1197882 0.3195649 -0.0092033 -0.0174603 -0.0475416 0.2651655 -0.0401634 0.1280843 -0.2265917 -0.0551107 -0.0389122 0.1687869 -0.010191 0.1004543 0.0415604 0.0631445 -0.1248428 0.9536801 -1.2362139 -0.3924029 -1.0152912 2.36888 0.6450155 -0.3041787 0.6155676 0.530053 3.0391437 0.1459937 0.6684492 -0.1324747 0.3189275 -0.0312737 0.6115831 0.0386867 0.4733163 -0.1039659 -0.0942631 0.0011095 -0.1446238 0.0464127 0.0227785 0.031045 0.0489714 0.0343951 -0.019509 -0.0379132 -0.0676953 -0.0541914 0.1049534 0.0198797 -0.1464122 0.0069705 -0.1079016 0.0562455 0.0677531 0.0011154 0.0780449 -0.0378703 -0.0594388 0.0122264 -0.0648085 0.1441597 0.0369455 -0.0764523 -0.0627872 -0.0493988 0.0170203 -0.0723113 -0.0464159 -0.0804145 0.1259012 unknown
polarizability: 178.817978|-26.2368419|131.9120545|19.6890791|30.1144909|63.2571854 unknown
InChI: InChI=1S/C9H4N2O2/c12-4-10-8-2-1-6-3-7(6)9(8)11-5-13/h1-2H,3H2
charge 0 multiplicity 1
17 atoms
O  1.581905 -3.448552 -1.175829
O  4.030813 0.607485 1.141295
N  0.33837 -1.449075 -0.580086
N  1.654176 0.73258 0.654247
C  -3.193755 -0.009214 -0.873708
C  -1.723486 -0.106101 -0.434428
C  -2.385384 1.060925 -0.123259
C  -0.360282 -0.316412 -0.242846
C  -1.786134 2.192824 0.43148
C  0.305618 0.817712 0.379673
C  -0.397088 2.018239 0.697695
C  0.953486 -2.446415 -0.876948
C  2.841297 0.660384 0.870519
H  -3.952304 -0.591439 -0.333253
H  -3.422105 0.140066 -1.938896
H  -2.297822 3.131651 0.660449
H  0.183696 2.828142 1.151795
