program: Gaussian 09
title: 000171599
version: EM64L-G09RevD.01
frameworkgroup: C1[X(C16H27NO)]
method: RPBEPBE
basis: SDD
operation: Freq
keyword: #p
keyword: freq=noraman
keyword: PBEPBE/SDD
title: #p freq=noraman PBEPBE/SDD
converged: YES YES NO NO
title: Mulliken charges:
elementType: O N C C C C C C C C C C C C C C C C H H H H H H H H H H H H H H H H H H H H H H H H H H H
charge: -0.270494 -0.110110 0.135189 0.501000 -0.700080 -0.700149 -0.747741 -0.404287 -0.378406 -0.425730 -0.292083 -0.325521 -0.330722 0.346878 -0.418660 -0.374901 -0.671609 -0.669270 0.205267 0.214697 0.222183 0.213758 0.205116 0.222718 0.215645 0.215335 0.216244 0.217562 0.221409 0.225569 0.242975 0.220265 0.206143 0.204960 0.189988 0.208749 0.191844 0.244649 0.245338 0.211252 0.226534 0.207245 0.208587 0.225103 0.207559
chargesum: 0.00000
title: Mulliken charges with hydrogens summed into heavy atoms:
elementType: O N C C C C C C C C C C C C C C C C
charge: -0.270494 -0.110110 0.135189 0.501000 -0.057932 -0.058556 -0.100517 0.034684 -0.152837 -0.182755 0.134325 0.069428 0.069872 0.346878 -0.174011 -0.129563 -0.026578 -0.028022
polarizability: 2.59441675e+02 2.10962590e+00 1.60737704e+02 2.61035031e-01 1.26098597e+01 1.50187318e+02
1716.lowfreq: -12.4481 -7.2505 -0.0005 0.0004 0.0006 6.2673 13.6932 28.5720 42.6487
frequency: 12.4026 28.5110 42.6213 51.0067 60.8901 83.7857 93.5514 108.3894 139.8536 167.3560 173.8564 200.0074 201.8788 218.7298 242.2515 251.8362 261.3143 292.6624 300.8084 316.9100 318.0642 351.6308 352.9981 377.2901 413.2070 432.2176 437.3692 451.3785 469.4187 499.2233 529.9299 547.6881 634.1647 656.3138 736.1800 741.2633 789.9586 796.8806 799.1558 812.7116 826.1922 835.6555 837.2888 914.8552 918.0108 928.4314 938.5227 940.7944 962.3452 974.7048 989.7134 1001.5187 1017.7191 1025.4254 1062.2530 1063.6817 1075.6665 1085.3044 1094.1471 1111.0015 1120.6981 1123.3836 1161.9516 1182.7493 1207.8129 1208.1770 1215.4354 1228.3208 1236.2409 1272.2496 1278.5939 1286.7965 1290.6385 1307.9390 1327.5633 1360.8581 1363.5973 1367.9871 1371.9271 1373.5262 1386.7004 1387.8736 1389.1826 1400.0986 1416.2330 1457.5401 1461.1624 1461.8421 1464.8316 1467.5204 1469.0647 1472.7342 1476.5733 1479.7694 1485.1798 1485.5446 1487.5110 1490.2151 1495.6448 1504.0739 1579.0881 1622.9082 2854.9261 2863.5519 2918.2740 2961.7623 2970.0455 2971.0101 2976.1922 2982.8644 2983.2604 3020.7811 3025.9252 3034.7757 3062.0074 3064.8692 3065.9984 3068.7443 3074.3866 3074.6823 3076.4797 3076.6444 3080.0413 3090.9395 3091.8005 3125.1308 3142.0784 3158.8142 3164.5436
redmass: 3.4812 3.2523 3.5114 3.5624 3.0630 2.2674 2.1056 4.1665 2.3805 1.9731 2.1585 1.3956 1.5562 1.3902 2.7422 1.0997 1.8607 2.0598 2.6964 1.3241 1.6827 2.5461 3.0309 2.8510 2.9539 3.5575 2.9068 2.9081 2.6265 3.4220 3.2914 2.2963 6.9666 4.9326 3.5778 2.9485 1.3957 1.1379 1.6048 1.7256 1.3145 1.6189 2.7909 1.8757 1.7516 1.6473 1.3301 1.2248 1.3546 7.6431 2.2423 2.7646 1.4467 1.3822 2.5080 1.7214 1.9096 2.1796 2.8005 2.3399 1.3727 1.7130 1.3911 1.4023 3.0275 2.2777 2.6402 2.4717 1.6860 3.1571 1.1180 1.2280 1.2199 1.2956 1.3320 1.6204 1.9378 1.6436 1.1979 1.2835 1.2810 1.2758 1.3643 1.2054 3.5858 1.0515 1.0587 1.0515 1.0479 1.0776 1.0612 1.0767 1.0706 1.0604 1.0534 1.0670 1.0910 1.0819 1.1640 1.8409 6.9953 6.3860 1.0720 1.0714 1.0700 1.0567 1.0346 1.0347 1.0357 1.0357 1.0357 1.0883 1.1019 1.0874 1.0950 1.1000 1.0998 1.1006 1.0984 1.0986 1.0980 1.0995 1.0991 1.1003 1.1003 1.0878 1.0868 1.0950 1.0956
irintensity: 0.3165 0.0075 0.2427 0.5680 0.0639 0.2405 0.1919 0.1061 1.3423 1.3878 1.1502 0.4694 0.7024 0.3468 0.6613 0.2077 0.4136 1.1572 3.4387 0.3582 0.6632 0.8148 0.2791 3.5695 0.0120 0.0841 2.6325 1.6333 4.1596 5.2851 8.5567 23.2420 0.6020 11.6122 1.4386 9.6221 1.8699 4.3337 20.2709 17.4001 3.0509 51.6292 0.5677 0.2819 2.4857 2.2618 0.0371 0.2157 0.2798 121.6269 7.8604 13.4217 1.9203 0.1284 33.7187 28.2635 16.8281 3.3018 13.8171 4.6092 12.6332 7.6470 8.9129 138.1004 8.2193 36.5736 4.1652 197.9640 23.2081 55.7640 0.8580 16.8744 18.0538 0.1291 4.3139 6.9296 10.0581 0.4476 20.2505 28.5132 11.6293 20.7827 17.9315 9.6084 6.9260 0.0654 4.6400 8.7175 0.6139 8.7755 0.5546 20.6252 16.8649 19.0690 12.3574 10.9743 30.6451 3.6040 1.0733 156.4850 16.1605 51.7148 32.9659 181.6394 65.7522 42.5705 35.3028 33.7400 35.2124 40.7027 21.1830 18.0613 21.9615 18.0954 38.0385 6.8922 4.4864 15.5174 147.0610 44.2943 73.2582 38.5206 44.0607 41.6545 44.1971 22.2917 15.0491 18.6556 6.0176
temp: 298.150 k
press: 1.00000 atm
elementType: 8 7 6 6 6 6 6 6 6 6 6 6 6 6 6 6 6 6 1 1 1 1 1 1 1 1 1 1 1 1 1 1 1 1 1 1 1 1 1 1 1 1 1 1 1
symmnumber: 1
zpe: 1038401.4 jmol-1
zpe.correction: 0.395506 hartree
zpe.thermalcorrener: 0.416538 hartree
zpe.thermalcorrenthalpy: 0.417483 hartree
zpe.thermalcorrgfe: 0.344122 hartree
zpe.sumelectzpe: -754.421769 hartree
zpe.sumelectthermal: -754.400737 hartree
zpe.sumelectthermalent: -754.399793 hartree
zpe.sumelectthermalfe: -754.473154 hartree
dipole: -1.1376 0.7179 0.2070
dipole: 1.3610
quadrupole: -97.2240 -111.7515 -113.2489
quadrupole: 0.3204 1.4811 1.5788
quadrupole: 10.1842 -4.3434 -5.8408 0.3204 1.4811 1.5788
hfenergy: -754.8172757 hartree
pointgroup: C01 [X(C16H27N1O1)]
dipole: -0.4487457 0.2908855 0.0268595 debye
polarizability: 259.4045498|2.179689|164.5311975|1.7371619|10.2732925|146.4309492 unknown
InChI: InChI=1S/C16H27NO/c1-6-17(7-2)12-13-18-15-10-8-14(9-11-15)16(3,4)5/h8-11H,6-7,12-13H2,1-5H3
charge 0 multiplicity 1
45 atoms
O  -0.858487 -1.001914 -0.518535
N  -4.40325 0.063741 -0.039784
C  4.73539 0.322078 0.3496
C  3.230687 0.021294 0.153293
C  5.407103 0.534877 -1.040898
C  5.417105 -0.881831 1.068279
C  4.975451 1.593778 1.203648
C  -3.264028 -0.819233 -0.395541
C  2.827776 -1.121979 -0.596228
C  2.202054 0.834656 0.684526
C  -1.941624 -0.15344 0.008239
C  -5.581741 -0.666146 0.496586
C  -4.744545 1.021578 -1.127174
C  0.463893 -0.604343 -0.258815
C  1.474226 -1.436652 -0.802358
C  0.831248 0.538688 0.488176
C  -5.365059 -1.1729 1.934874
C  -5.404156 2.314423 -0.610627
H  6.488233 0.737243 -0.919029
H  5.299167 -0.355787 -1.685849
H  4.950308 1.39155 -1.569514
H  5.318227 -1.814341 0.484115
H  6.496513 -0.683116 1.209586
H  4.962214 -1.055105 2.060735
H  6.061935 1.765626 1.316067
H  4.541671 2.493428 0.728856
H  4.545387 1.492551 2.217474
H  -3.233686 -1.060467 -1.483058
H  -3.352874 -1.780462 0.140087
H  3.586705 -1.783302 -1.030302
H  2.455451 1.724337 1.268854
H  -1.874395 -0.077161 1.111313
H  -1.864916 0.866269 -0.422605
H  -6.437012 0.033797 0.497095
H  -5.872261 -1.519975 -0.166834
H  -3.804583 1.289361 -1.645508
H  -5.40088 0.543112 -1.897817
H  1.174883 -2.317475 -1.379252
H  0.073882 1.199801 0.920161
H  -4.524622 -1.887995 1.997847
H  -5.141074 -0.324965 2.605252
H  -6.270759 -1.68962 2.304064
H  -6.359106 2.112923 -0.092207
H  -4.733466 2.826006 0.10153
H  -5.619484 3.00019 -1.451419
