program: Gaussian 09
title: 000012763
version: EM64L-G09RevD.01
frameworkgroup: C1[X(C9H18)]
method: RPBEPBE
basis: SDD
operation: Freq
keyword: #p
keyword: freq=noraman
keyword: PBEPBE/SDD
title: #p freq=noraman PBEPBE/SDD
converged: YES YES NO NO
title: Mulliken charges:
elementType: C C C C C C C C C H H H H H H H H H H H H H H H H H H
charge: 0.028767 -0.456034 -0.456290 -0.037775 -0.405648 -0.405654 -0.380016 -0.738432 -0.738588 0.181107 0.186424 0.207973 0.208261 0.186472 0.192602 0.194003 0.189091 0.189077 0.194018 0.197284 0.186287 0.205416 0.208088 0.224985 0.205467 0.208046 0.225071
chargesum: 0.00000
title: Mulliken charges with hydrogens summed into heavy atoms:
elementType: C C C C C C C C C
charge: 0.209874 -0.061636 -0.061557 0.154827 -0.022554 -0.022560 0.003555 -0.099944 -0.100005
polarizability: 1.08283442e+02 -3.66945176e-04 9.37091565e+01 -1.89239380e-01 -4.81712694e-04 8.01266583e+01
1716.lowfreq: -23.1689 -0.0005 -0.0004 0.0003 7.2867 17.6012 46.3173 104.3959 165.4768
frequency: 46.0195 104.3627 165.4278 209.6852 214.1317 230.4909 295.5087 328.4904 383.0654 390.7537 426.0149 426.8449 476.0940 517.7418 768.1527 779.1356 830.1003 853.2375 871.2814 887.9861 910.2781 914.0273 941.5161 956.0246 989.2149 1052.4035 1054.6981 1066.9314 1086.0918 1113.7446 1126.3407 1164.7673 1171.9185 1191.8686 1232.2729 1256.7156 1257.3074 1275.0715 1296.7824 1311.3815 1319.4521 1325.2408 1336.3496 1336.5113 1339.9701 1359.7994 1376.5808 1393.8839 1456.0684 1460.5850 1460.7933 1467.4851 1468.0440 1475.3368 1475.5964 1482.3682 1494.5605 2919.0130 2943.4395 2948.9974 2958.5510 2961.4371 2961.6945 2964.6038 2968.1944 2971.4168 3021.0433 3022.4361 3030.8692 3031.0201 3040.5181 3056.9258 3064.0828 3074.8673 3078.8806
redmass: 2.3715 2.4157 1.5187 1.1831 1.7430 1.6066 1.8036 2.5600 1.7956 2.9056 2.2196 3.0183 2.3632 1.5525 2.0881 1.4606 3.0257 1.6777 1.9662 1.4341 1.2013 1.9324 2.1807 1.4406 1.5534 1.2348 1.8635 1.4724 2.0070 2.6636 1.6324 2.1154 1.9282 1.5462 1.4632 1.2868 1.2088 1.2712 1.2335 1.3743 1.4281 1.4540 1.5672 1.4035 1.5193 1.4686 1.2146 1.2060 1.0825 1.0893 1.0877 1.0567 1.0793 1.0475 1.0901 1.0621 1.0473 1.0795 1.0807 1.0651 1.0696 1.0610 1.0598 1.0651 1.0366 1.0370 1.0979 1.0957 1.0983 1.0985 1.1012 1.0986 1.0979 1.0988 1.0980
irintensity: 0.0028 0.0084 0.0912 0.0125 0.1091 0.0005 0.2087 0.0236 0.2578 0.0051 0.1342 0.0534 0.1176 0.7662 1.5626 0.0222 2.4808 6.7771 1.6995 12.0230 4.3488 0.0513 1.0474 0.0014 13.8720 0.0031 0.8848 0.1806 2.3577 0.0228 0.4986 2.4089 7.0929 0.6926 1.9059 1.3056 5.5843 0.5380 0.1032 0.3655 5.5705 0.0033 1.6722 0.4003 0.1346 1.9152 20.9055 17.5628 3.5614 5.0730 9.2646 0.0887 20.9401 3.8399 6.1766 3.4392 24.2084 3.2223 9.5196 19.0578 65.7996 33.0013 53.7314 35.9397 27.6310 34.3750 84.9823 85.8558 15.4134 20.6249 137.5490 1.0685 104.0009 43.9022 45.2456
temp: 298.150 k
press: 1.00000 atm
elementType: 6 6 6 6 6 6 6 6 6 1 1 1 1 1 1 1 1 1 1 1 1 1 1 1 1 1 1
symmnumber: 1
zpe: 655676.2 jmol-1
zpe.correction: 0.249734 hartree
zpe.thermalcorrener: 0.259902 hartree
zpe.thermalcorrenthalpy: 0.260846 hartree
zpe.thermalcorrgfe: 0.214733 hartree
zpe.sumelectzpe: -353.005862 hartree
zpe.sumelectthermal: -352.995694 hartree
zpe.sumelectthermalent: -352.994750 hartree
zpe.sumelectthermalfe: -353.040863 hartree
dipole: 0.0327 0.0003 -0.0254
dipole: 0.0414
quadrupole: -59.9139 -59.7526 -58.3725
quadrupole: 0.0003 0.1497 0.0004
quadrupole: -0.5676 -0.4062 0.9738 0.0003 0.1497 0.0004
hfenergy: -353.2555959 hartree
pointgroup: C01 [X(C9H18)]
dipole: 0.0127833 -0.0001134 0.0101117 debye
polarizability: 108.2777543|0.0070219|93.7091348|0.4425468|-0.0182507|80.132368 unknown
InChI: InChI=1S/C9H18/c1-8(2)9-6-4-3-5-7-9/h8-9H,3-7H2,1-2H3
charge 0 multiplicity 1
27 atoms
C  -0.333114 -0.001484 -0.217971
C  0.443413 1.268046 0.230093
C  0.444502 -1.269891 0.231409
C  -1.808848 -0.001007 0.30169
C  1.917162 1.268303 -0.243203
C  1.918357 -1.269118 -0.241597
C  2.665245 0.000246 0.22555
C  -2.588669 1.260819 -0.147851
C  -2.588446 -1.265369 -0.141185
H  -0.373173 -0.002059 -1.332174
H  0.417204 1.325549 1.340029
H  -0.059055 2.177632 -0.14841
H  -0.056862 -2.180217 -0.146693
H  0.418012 -1.326732 1.341387
H  -1.765755 0.002025 1.413792
H  2.430458 2.178457 0.124669
H  1.943186 1.312983 -1.352282
H  1.944509 -1.315087 -1.350625
H  2.432565 -2.178322 0.127354
H  3.704615 0.000481 -0.157154
H  2.729518 0.000995 1.333718
H  -2.591083 1.345874 -1.252442
H  -3.641635 1.205445 0.186124
H  -2.158777 2.19056 0.263724
H  -2.587364 -1.358738 -1.245118
H  -3.642446 -1.206456 0.188904
H  -2.160918 -2.192434 0.278762
