program: Gaussian 09
title: 000170948
version: EM64L-G09RevD.01
frameworkgroup: C1[X(C11H20O4)]
method: RPBEPBE
basis: SDD
operation: Freq
keyword: #pfreq=noraman
keyword: PBEPBE/SDD
title: #p freq=noraman PBEPBE/SDD
converged: YES YES NO NO
title: Mulliken charges:
elementType: O O O O C C C C C C C C C C C H H H H H H H H H H H H H H H H H H H H
charge: -0.278600 -0.261318 -0.246913 -0.240481 0.009003 -0.280599 -0.706632 -0.492108 -0.345200 -0.491081 -0.345600 0.265002 0.261869 -0.683248 -0.682887 0.252079 0.219833 0.244311 0.238003 0.239701 0.222829 0.255002 0.218039 0.239523 0.239900 0.221853 0.212517 0.215045 0.219669 0.223386 0.208089 0.208459 0.223643 0.208089 0.208825
chargesum: 0.00000
title: Mulliken charges with hydrogens summed into heavy atoms:
elementType: O O O O C C C C C C C C C C C
charge: -0.278600 -0.261318 -0.246913 -0.240481 0.261082 0.183545 -0.010761 -0.014404 0.089170 -0.011659 0.089113 0.265002 0.261869 -0.043315 -0.042329
polarizability: 1.52621855e+02 -1.71269669e+00 1.36821045e+02 5.77925086e+00 -1.98254700e+00 1.10710465e+02
1716.lowfreq: -4.2368 -0.0007 -0.0005 -0.0002 1.8807 6.8661 12.6445 18.9623 26.1799
frequency: 12.0248 18.4613 26.0688 31.9085 41.5478 58.6621 80.3464 86.0389 101.5964 125.3563 169.6791 186.3829 211.4907 229.4117 233.0095 236.0466 236.9525 270.0347 325.6558 341.3552 380.7990 429.3052 446.3675 500.4505 546.5717 555.6533 668.3576 693.1457 736.0550 736.6204 778.9757 864.9142 867.6562 868.4737 875.9828 884.0212 912.7758 931.4936 941.3711 983.0566 1052.9544 1054.0836 1063.8907 1096.7529 1099.7136 1105.1221 1110.7592 1118.1162 1131.9505 1142.9054 1160.9319 1218.9356 1219.3131 1223.5226 1282.9126 1284.6370 1288.8382 1292.0669 1299.5646 1332.3777 1358.9832 1362.7372 1376.7235 1392.4979 1393.4626 1394.3039 1439.9775 1440.8958 1454.1787 1468.0623 1473.1504 1473.5310 1479.4991 1479.5323 1479.8491 1485.9662 1486.1338 1640.9010 1643.8156 2973.8539 2974.6651 2986.6251 2987.2449 2993.3897 3004.1315 3004.6135 3013.7912 3030.8109 3032.1064 3044.9462 3051.7338 3051.7537 3076.6581 3077.6840 3078.1907 3078.4902 3081.0209 3092.4551 3106.9489
redmass: 1.9047 4.6030 4.9208 4.9002 1.8819 2.6746 3.1749 3.6147 3.2185 3.2291 3.5724 3.3109 1.2075 3.9611 1.1042 2.9248 1.0837 3.1176 4.1649 3.2661 3.7190 3.4098 3.0808 3.6184 2.6499 2.8770 6.3336 4.6954 1.1781 1.1817 3.8564 3.9300 1.4126 1.3367 2.7664 2.2581 1.6429 1.7259 2.9036 3.1531 2.3974 2.4188 2.2947 1.8486 1.6405 2.4731 2.7882 2.4303 2.4516 2.8564 1.6976 1.3377 1.3268 1.1670 1.2105 1.1542 1.2469 1.3957 1.3950 1.2776 1.6497 1.7294 1.6926 1.2218 1.2183 1.2148 1.0864 1.0854 1.0779 1.0629 1.0549 1.0543 1.0451 1.0422 1.0418 1.0772 1.0785 9.8730 9.8534 1.0360 1.0360 1.0620 1.0615 1.0364 1.0611 1.0608 1.0579 1.0975 1.0971 1.0863 1.1002 1.1004 1.0989 1.0990 1.1020 1.1021 1.1049 1.1000 1.1002
irintensity: 0.0057 0.2449 1.6479 0.9101 0.6281 0.7013 0.6794 1.3497 0.9189 3.5290 2.7152 8.0311 1.4418 8.0208 0.1706 3.1695 0.1915 6.1341 1.6218 1.3249 2.6305 22.8542 1.0609 2.4886 1.4726 5.8212 2.6589 6.4471 12.8607 13.4590 5.9231 2.7875 0.2841 0.1289 13.3896 2.2403 2.0565 1.8013 96.2299 80.2059 45.7991 7.2792 74.5530 105.7086 19.8618 151.1295 62.3064 4.3343 253.9197 152.0997 2.5266 0.7755 0.3700 1.4619 30.1011 12.9327 36.7055 40.7586 12.8250 2.7475 18.8364 28.7661 20.1587 12.3764 11.7963 8.3374 19.3319 30.4243 4.1888 16.3390 5.1573 4.2355 7.2978 16.2699 12.9568 15.8718 16.2028 250.5427 94.8899 35.1897 35.4581 7.2907 6.7086 13.8784 23.8767 22.2976 24.5051 1.8660 2.0843 5.3099 0.1020 0.0452 50.8521 49.1871 74.7188 73.3784 4.8218 47.6485 15.5564
temp: 298.150 k
press: 1.00000 atm
elementType: 8 8 8 8 6 6 6 6 6 6 6 6 6 6 6 1 1 1 1 1 1 1 1 1 1 1 1 1 1 1 1 1 1 1 1
symmnumber: 1
zpe: 775591.3 jmol-1
zpe.correction: 0.295407 hartree
zpe.thermalcorrener: 0.314425 hartree
zpe.thermalcorrenthalpy: 0.315369 hartree
zpe.thermalcorrgfe: 0.243020 hartree
zpe.sumelectzpe: -730.867423 hartree
zpe.sumelectthermal: -730.848405 hartree
zpe.sumelectthermalent: -730.847461 hartree
zpe.sumelectthermalfe: -730.919810 hartree
dipole: 0.4279 -0.6579 -0.3761
dipole: 0.8703
quadrupole: -93.8951 -83.0197 -97.5248
quadrupole: 4.1040 -12.3346 2.0177
quadrupole: -2.4152 8.4602 -6.0450 4.1040 -12.3346 2.0177
hfenergy: -731.1628299 hartree
pointgroup: C01 [X(C11H20O4)]
dipole: 0.170739 0.2568023 0.1487743 debye
polarizability: 152.7617881|1.4904589|136.7662167|-5.4574096|-1.9520901|110.6253595 unknown
InChI: InChI=1S/C11H20O4/c1-4-6-10(12)14-8-9(3)15-11(13)7-5-2/h9H,4-8H2,1-3H3
charge 0 multiplicity 1
35 atoms
O  1.47485 -0.840883 0.483981
O  -1.367476 -0.664963 -0.181887
O  2.791837 -0.530085 -1.418844
O  -3.217705 -1.126852 1.155299
C  0.705069 -1.919951 -0.218948
C  -0.699807 -1.874233 0.366614
C  1.401565 -3.267384 0.017999
C  3.130588 0.890733 0.584986
C  4.385446 1.496076 -0.07507
C  -3.194483 0.884554 -0.300909
C  -4.648568 1.186561 0.113384
C  2.4909 -0.208994 -0.246275
C  -2.64915 -0.391623 0.316634
C  4.98345 2.641277 0.768327
C  -5.161799 2.501095 -0.510018
H  0.688698 -1.674306 -1.296103
H  -1.278241 -2.769299 0.072084
H  -0.67858 -1.814551 1.468982
H  3.361479 0.48127 1.587053
H  2.36402 1.673961 0.753188
H  1.442424 -3.510451 1.094559
H  2.430401 -3.232212 -0.376293
H  0.862859 -4.077983 -0.505801
H  -2.523542 1.716532 -0.007185
H  -3.101774 0.804692 -1.401418
H  4.123788 1.860473 -1.085475
H  5.140026 0.700827 -0.224536
H  -5.297384 0.343327 -0.189277
H  -4.709996 1.236852 1.216274
H  5.881219 3.064701 0.282915
H  4.254551 3.463079 0.902423
H  5.279811 2.288261 1.77432
H  -6.204084 2.703763 -0.204494
H  -4.544778 3.363343 -0.193338
H  -5.137513 2.458795 -1.615448
