program: Gaussian 09
title: 000176645
version: EM64L-G09RevD.01
frameworkgroup: C1[X(C4H10BrNO)]
method: RPBEPBE
basis: SDD
operation: Freq
keyword: #p
keyword: freq=noraman
keyword: PBEPBE/SDD
title: #p freq=noraman PBEPBE/SDD
converged: YES YES NO NO
title: Mulliken charges:
elementType: Br O N C C C C H H H H H H H H H H
charge: -0.055959 -0.439106 -0.316234 -0.361815 -0.311944 -0.324403 -0.642640 0.202212 0.214057 0.229083 0.233754 0.258998 0.210060 0.208084 0.271345 0.288280 0.336228
chargesum: 0.00000
title: Mulliken charges with hydrogens summed into heavy atoms:
elementType: Br O N C C C C
charge: -0.055959 -0.102878 -0.057236 0.054454 0.150892 0.093741 -0.083015
polarizability: 1.11032842e+02 5.83614852e+00 5.61931286e+01 -3.23034787e-01 1.24097490e+00 4.90848592e+01
1716.lowfreq: -5.7102 -0.0004 -0.0004 -0.0003 8.1711 13.6014 33.0929 65.2777 77.7305
frequency: 31.2516 65.1675 77.3750 119.8629 170.1218 194.9375 251.2361 317.9145 409.2329 442.6439 609.5032 652.8491 768.1836 812.8770 955.2952 963.3574 1014.3532 1039.5038 1058.9373 1079.1265 1114.8045 1153.0577 1205.8795 1225.7633 1270.8572 1281.6660 1296.1687 1333.8219 1366.5818 1392.0063 1445.8084 1463.3411 1472.5014 1481.8682 1491.7862 2906.9815 2932.5380 2981.4534 3001.4447 3052.0131 3060.3439 3068.7254 3152.0738 3460.7019 3565.8532
redmass: 4.1804 4.5802 1.9057 2.8407 4.0778 3.4311 4.5688 1.1439 3.5041 5.3663 4.6376 1.2731 1.1272 1.1111 3.6039 1.6976 2.3364 2.8996 1.5363 3.2423 1.1584 3.3261 1.3808 1.2835 1.1684 1.1823 1.1796 1.2599 1.2503 1.3232 1.1110 1.1960 1.0717 1.0893 1.0866 1.0674 1.0695 1.0642 1.0913 1.0857 1.0637 1.1023 1.1108 1.0745 1.0663
irintensity: 0.9512 4.1017 7.0599 9.8896 3.5115 2.5650 1.7890 164.4464 21.0190 18.3901 80.5712 104.3657 7.0412 8.5060 69.9129 11.7224 29.0354 13.6378 2.8074 8.8992 85.3742 65.4031 3.5028 34.5082 0.9512 2.2915 1.9128 12.3813 9.2177 1.1267 10.6132 26.0819 3.8044 1.0359 9.1707 70.7392 67.3345 66.9581 24.4591 11.0727 23.1370 48.3896 11.5642 0.0224 8.4529
temp: 298.150 k
press: 1.00000 atm
elementType: 35 8 7 6 6 6 6 1 1 1 1 1 1 1 1 1 1
symmnumber: 1
zpe: 372109.0 jmol-1
zpe.correction: 0.141729 hartree
zpe.thermalcorrener: 0.151172 hartree
zpe.thermalcorrenthalpy: 0.152116 hartree
zpe.thermalcorrgfe: 0.104744 hartree
zpe.sumelectzpe: -301.233611 hartree
zpe.sumelectthermal: -301.224168 hartree
zpe.sumelectthermalent: -301.223224 hartree
zpe.sumelectthermalfe: -301.270596 hartree
dipole: 1.2208 0.1749 -0.3192
dipole: 1.2739
quadrupole: -73.3542 -50.4219 -50.6035
quadrupole: -2.3862 -5.1573 3.4776
quadrupole: -15.2277 7.7046 7.5231 -2.3862 -5.1573 3.4776
hfenergy: -301.3753403 hartree
pointgroup: C01 [X(C4H10Br1N1O1)]
dipole: 0.4816418 0.1075412 -0.0875526 debye
dipolederiv: -0.7255364 -0.0363051 -0.0699431 -0.1935325 -0.2026148 -0.0230647 -0.0528273 0.0003585 -0.1658405 -0.924972 0.0417048 0.1968466 0.0883854 -0.5641185 0.102539 0.234502 0.08799 -0.2066969 -1.1950933 0.0182253 -0.0102107 0.0111356 -0.4973852 0.1984616 0.1015611 0.1643238 -0.2333104 0.4500727 -0.1988754 0.0208724 -0.2939902 0.2484386 -0.064277 -0.2979957 -0.03932 0.274421 0.5645982 0.147137 -0.0303748 -0.1270593 0.1744808 -0.1414371 0.2056785 -0.0543793 0.2820478 0.6416531 -0.1018919 -0.0823073 -0.0687374 0.4085699 0.0018448 -0.1344055 0.0330495 0.3236983 0.9290793 0.1963364 0.0790718 0.4222688 0.1780159 0.079436 0.0165534 0.0557642 0.104155 0.0312777 -0.0137001 -0.042969 0.0164128 0.0058902 -0.0875106 0.0090254 -0.1138852 -0.123679 -0.1220606 0.0584583 -0.0177131 0.1500422 -0.1394547 0.1213792 -0.0332899 0.1529165 -0.055068 -0.0797333 -0.0696184 0.0440212 -0.0758551 -0.0330651 0.1110723 0.0764214 0.1389879 -0.1074764 0.0511263 0.0271226 0.0434003 0.0178768 -0.0159901 -0.0847495 0.0255766 -0.1063803 -0.0254696 0.0856057 -0.0052711 -0.0088631 0.0121322 0.2378435 -0.0947317 -0.0211286 -0.1613796 0.0601684 0.0337554 0.0073524 -0.0059191 0.0014627 0.0141008 -0.086323 -0.0023173 -0.1296389 -0.0990312 -0.0087894 0.0690002 -0.0155636 0.0301074 -0.0990975 0.1112128 -0.0070157 0.1490791 -0.0549717 -0.040902 -0.0636668 -0.0325324 -0.0034792 -0.0333902 -0.086291 -0.000988 -0.1141216 -0.0004213 -0.0244951 -0.0807847 0.0496748 -0.0255211 0.0225116 0.0723535 -0.0251084 0.0655811 -0.0263811 0.3344138 0.0047765 -0.117491 0.0383508 0.2952649 -0.1299146 -0.0942419 -0.1289458 0.0538557 unknown
polarizability: 110.6454358|6.6902049|55.3688286|3.1921918|3.0766185|50.2965659 unknown
InChI: InChI=1S/C4H10BrNO/c5-1-2-6-3-4-7/h6-7H,1-4H2
charge 0 multiplicity 1
17 atoms
Br -4.127666 -0.226678 -0.325276
O  3.756286 -0.257495 -0.227823
N  0.059617 0.316612 0.336498
C  1.283141 -0.457116 0.038964
C  -1.23311 -0.3858 0.209844
C  2.503127 0.484116 -0.03133
C  -2.299316 0.656691 -0.157461
H  1.143451 -0.949693 -0.94449
H  1.500117 -1.262083 0.780165
H  -1.54193 -0.941924 1.123167
H  -1.154312 -1.125923 -0.6064
H  0.135702 0.84217 1.216322
H  2.645646 1.006026 0.931479
H  2.341162 1.246391 -0.820644
H  -2.429871 1.42667 0.619143
H  -2.096374 1.121323 -1.132631
H  3.748929 -0.676386 -1.125127
