program: Gaussian 09
title: 000182046
version: EM64L-G09RevD.01
frameworkgroup: C1[X(C9H16ClNO2)]
method: RPBEPBE
basis: SDD
operation: Freq
keyword: #p
keyword: freq=noraman
keyword: PBEPBE/SDD
title: #p freq=noraman PBEPBE/SDD
converged: YES YES NO NO
title: Mulliken charges:
elementType: Cl O O N C C C C C C C C C H H H H H H H H H H H H H H H H
charge: -0.059614 -0.309207 -0.291954 -0.394077 -0.056381 -0.418006 -0.447994 -0.399174 -0.411381 -0.377554 0.293903 -0.232811 -0.548066 0.251374 0.243617 0.193266 0.203484 0.217578 0.207745 0.205005 0.209129 0.183995 0.193155 0.203174 0.322747 0.220092 0.270118 0.255655 0.272181
chargesum: 0.00000
title: Mulliken charges with hydrogens summed into heavy atoms:
elementType: Cl O O N C C C C C C C C C
charge: -0.059614 -0.309207 -0.291954 -0.071330 0.194993 0.018878 -0.026932 0.013576 -0.018256 0.018776 0.293903 0.257398 -0.020231
polarizability: 1.36707178e+02 -6.97863495e+00 1.07808327e+02 -1.22387644e+00 3.37051381e+00 1.02238463e+02
1716.lowfreq: -10.2906 -5.7566 -0.0028 -0.0018 -0.0013 13.7330 16.0032 25.5423 56.5792
frequency: 11.8693 24.2431 56.5455 67.3696 82.7492 130.3588 183.9070 204.8064 228.3493 262.6517 313.5197 352.7285 371.1584 414.3903 457.6403 464.3135 486.6206 544.9424 606.5331 627.8515 673.0620 701.1696 773.8241 782.9389 821.4537 836.3152 861.7402 872.9030 910.2886 927.4726 953.2048 990.0119 1011.8470 1028.7860 1045.6515 1056.2819 1086.7933 1090.0124 1113.4770 1151.4718 1157.7795 1181.9173 1190.9796 1228.4492 1243.6133 1256.9890 1273.7347 1298.5959 1302.0226 1325.9154 1331.0151 1334.7799 1348.3080 1354.4284 1357.0739 1369.2908 1433.3232 1455.7469 1457.3627 1461.3456 1466.6029 1471.0190 1473.4861 1486.8743 1682.6804 2953.6739 2965.9592 2975.9254 2977.3443 2983.4924 2990.5600 3021.8666 3028.4605 3031.1097 3040.3207 3045.2510 3054.9296 3055.3004 3072.4737 3140.4590 3568.1067
redmass: 8.3010 4.4576 7.9745 4.7501 3.2912 3.8738 4.8839 2.4120 3.5244 2.5365 2.7535 1.9941 2.6044 2.8245 2.5873 2.8722 2.0834 1.1975 4.7335 2.6889 5.6119 8.3508 1.5583 3.2435 2.6767 1.7192 2.3258 2.1860 2.0107 1.5722 2.3709 1.9627 2.8564 2.1085 1.4690 1.7317 1.8221 2.7067 1.0415 2.1835 2.0296 1.4429 1.7380 1.1378 1.3384 1.2722 1.3083 1.2980 1.5121 1.4438 1.3480 1.4384 1.4201 1.3942 1.4242 1.3420 1.1016 1.1451 1.1065 1.0950 1.2092 1.1089 1.1744 1.2796 9.7253 1.0674 1.0624 1.0656 1.0615 1.0623 1.0609 1.0861 1.0937 1.0970 1.1006 1.1015 1.0926 1.0679 1.0989 1.1096 1.0770
irintensity: 0.7682 0.7110 7.7580 1.0082 2.0962 2.3754 1.7126 2.0104 5.1550 1.5691 18.0985 3.1591 2.4593 9.2101 4.9465 5.7098 0.4888 90.1689 20.1986 7.6430 8.1229 19.2535 1.7707 5.3823 0.0505 3.5484 7.7150 8.3369 31.8106 19.1999 71.5963 4.7485 10.5427 79.7912 7.6430 2.9208 38.6726 130.1610 1.5149 4.5371 22.2560 37.8056 104.3815 2.4703 9.7736 2.8646 4.3883 12.0475 25.1830 11.5451 7.3983 0.1362 5.5577 1.5245 1.0347 4.3312 12.4900 58.4007 21.3566 8.5759 109.5832 13.9322 124.7649 147.1776 293.4213 31.0690 38.5643 22.2175 26.6327 23.8970 47.3261 45.1692 76.3592 42.7136 23.8202 64.2562 84.8098 3.5782 5.5743 12.2662 32.2845
temp: 298.150 k
press: 1.00000 atm
elementType: 17 8 8 7 6 6 6 6 6 6 6 6 6 1 1 1 1 1 1 1 1 1 1 1 1 1 1 1 1
symmnumber: 1
zpe: 642573.0 jmol-1
zpe.correction: 0.244743 hartree
zpe.thermalcorrener: 0.258532 hartree
zpe.thermalcorrenthalpy: 0.259477 hartree
zpe.thermalcorrgfe: 0.200972 hartree
zpe.sumelectzpe: -1016.794805 hartree
zpe.sumelectthermal: -1016.781016 hartree
zpe.sumelectthermalent: -1016.780072 hartree
zpe.sumelectthermalfe: -1016.838576 hartree
dipole: -1.1545 -0.8251 -2.8524
dipole: 3.1859
quadrupole: -70.5479 -89.4001 -88.0152
quadrupole: -5.7904 -5.6494 2.8930
quadrupole: 12.1065 -6.7457 -5.3608 -5.7904 -5.6494 2.8930
hfenergy: -1017.0395484 hartree
pointgroup: C01 [X(C9H16Cl1N1O2)]
dipole: -0.3340899 -0.3412911 1.1588869 debye
polarizability: 137.7024413|4.5978132|102.7215574|1.4943263|3.2265714|106.3299694 unknown
InChI: InChI=1S/C9H16ClNO2/c10-6-7-13-9(12)11-8-4-2-1-3-5-8/h8,11H,1-7H2
charge 0 multiplicity 1
29 atoms
Cl 3.335199 -1.445986 -1.560909
O  1.95342 0.297194 0.823973
O  1.076331 1.872896 -0.718432
N  -0.299338 0.501153 0.601796
C  -1.593118 0.996719 0.076618
C  -1.938421 0.350997 -1.294446
C  -2.709638 0.722692 1.114102
C  -2.260171 -1.155233 -1.162608
C  -3.049555 -0.784179 1.240624
C  -3.394187 -1.400641 -0.137395
C  0.899132 0.974364 0.14289
C  3.317861 0.610033 0.369338
C  4.043119 -0.677192 0.009115
H  -1.477123 2.087128 -0.067582
H  -1.098632 0.519406 -1.992962
H  -2.818949 0.882696 -1.709926
H  -3.616871 1.26379 0.781009
H  -2.422434 1.146031 2.095964
H  -1.34798 -1.699854 -0.844131
H  -2.542623 -1.565993 -2.150584
H  -3.894297 -0.914206 1.943819
H  -2.195607 -1.339493 1.684657
H  -4.331282 -0.940625 -0.514806
H  -3.589671 -2.485171 -0.031792
H  -0.280139 -0.261196 1.279763
H  3.843774 1.091666 1.217414
H  3.269274 1.316301 -0.478494
H  5.106822 -0.484037 -0.201732
H  3.932804 -1.444259 0.789514
