program: Gaussian 09
title: 000182029
version: EM64L-G09RevD.01
frameworkgroup: C1[X(C14H11N)]
method: RPBEPBE
basis: SDD
operation: Freq
keyword: #pfreq=noraman
keyword: PBEPBE/SDD
title: #p freq=noraman PBEPBE/SDD
converged: YES YES NO NO
title: Mulliken charges:
elementType: N C C C C C C C C C C C C C C H H H H H H H H H H H
charge: -0.282328 0.208536 0.271830 0.435475 -0.210432 -0.425350 -0.322707 -0.404342 -0.378997 -0.393241 -0.237767 -0.244458 -0.216144 -0.218266 -0.246858 0.261772 0.255323 0.252968 0.238619 0.252841 0.267944 0.221103 0.221798 0.229781 0.230541 0.232357
chargesum: 0.00000
title: Mulliken charges with hydrogens summed into heavy atoms:
elementType: N C C C C C C C C C C C C C C
charge: -0.282328 0.208536 0.271830 0.435475 0.051340 -0.170026 -0.069739 -0.165723 -0.126156 -0.125297 -0.016664 -0.022660 0.013637 0.012275 -0.014501
polarizability: 2.38100963e+02 2.43047832e+00 1.60091629e+02 -4.02337601e+00 -4.45596067e+00 7.44106465e+01
1716.lowfreq: -8.9350 -0.0009 0.0003 0.0005 2.5528 4.7070 56.2663 71.8616 96.2920
frequency: 56.2612 71.8436 96.2913 215.4177 216.5462 250.8298 319.2036 361.5233 409.8217 425.3909 459.1065 513.4336 573.7356 577.2827 598.3733 603.5777 618.9797 692.8025 700.7211 732.6571 748.5275 753.3582 769.4891 776.8473 841.2761 856.1751 865.0163 872.6004 912.2274 938.4631 944.4080 969.7875 974.7740 988.2323 990.6136 1017.2551 1025.2171 1063.8100 1081.6861 1106.6011 1140.2376 1170.0081 1173.1913 1187.4032 1218.5916 1234.4312 1288.2384 1325.0701 1334.6447 1364.9523 1380.2680 1413.4011 1444.6826 1455.6250 1469.9286 1491.7940 1518.9472 1580.3921 1594.4001 1612.8893 1622.1967 3126.3217 3130.0939 3137.4211 3138.4766 3151.3013 3154.3135 3161.5676 3167.7560 3172.7913 3211.2986 3238.3423
redmass: 4.2189 4.2557 4.5377 4.3145 4.1634 4.7012 5.6178 4.9064 2.9140 2.9337 3.7769 3.9702 4.6735 3.7219 4.1160 6.6921 5.6024 5.8481 2.0991 1.5411 1.6344 2.2059 2.4274 2.0200 1.2686 1.3327 1.4336 4.7360 1.4126 1.3787 4.9598 1.3719 1.3290 5.3979 1.3110 2.1110 2.1672 1.5061 1.5406 2.1466 1.5711 1.1052 1.0514 1.1186 2.4030 1.7430 1.8686 1.4202 2.6962 2.8962 7.6373 4.2955 2.3820 3.3918 3.0862 2.7429 4.8416 6.4709 6.6670 6.2249 7.2581 1.0850 1.0849 1.0887 1.0898 1.0934 1.0953 1.0964 1.0993 1.1003 1.0903 1.1065
irintensity: 1.1097 0.6109 0.2206 0.1910 7.4242 0.2522 0.6910 1.0916 2.3040 11.3049 3.6865 6.7341 5.8363 3.2009 1.8967 4.4678 1.2572 8.9635 40.9792 19.5195 34.7810 94.5828 50.7268 37.8680 0.4159 0.3701 6.7471 4.3498 6.6355 2.8181 6.5027 0.4897 0.1540 0.0540 0.6047 12.5969 4.5801 6.3184 9.6530 5.7236 14.2425 0.3074 0.1362 3.3727 33.2377 30.5319 6.7880 14.2240 62.3599 10.4113 1.5580 10.1074 9.9979 96.5650 8.2815 173.9845 58.4697 2.3335 4.5107 91.0994 0.0646 0.1869 3.8975 2.9681 15.6099 36.3345 33.0470 9.0263 25.2910 9.6600 1.7132 2.0696
temp: 298.150 k
press: 1.00000 atm
elementType: 7 6 6 6 6 6 6 6 6 6 6 6 6 6 6 1 1 1 1 1 1 1 1 1 1 1
symmnumber: 1
zpe: 543111.4 jmol-1
zpe.correction: 0.206860 hartree
zpe.thermalcorrener: 0.217815 hartree
zpe.thermalcorrenthalpy: 0.218759 hartree
zpe.thermalcorrgfe: 0.169569 hartree
zpe.sumelectzpe: -593.829367 hartree
zpe.sumelectthermal: -593.818412 hartree
zpe.sumelectthermalent: -593.817468 hartree
zpe.sumelectthermalfe: -593.866659 hartree
dipole: 1.8314 0.0947 0.0335
dipole: 1.8342
quadrupole: -76.2361 -77.4239 -92.5132
quadrupole: -0.7105 -1.3020 -1.9280
quadrupole: 5.8216 4.6339 -10.4555 -0.7105 -1.3020 -1.9280
hfenergy: -594.0362275 hartree
pointgroup: C01 [X(C14H11N1)]
dipole: -0.7205862 0.0341709 -0.017754 debye
dipolederiv: -1.4440881 -0.070636 -0.0062862 -0.5426423 -0.4177283 0.0176064 0.0774504 0.0358057 -0.0900044 0.7881546 -0.3002629 0.0903541 -0.3941027 -0.1434233 0.009809 -0.0800282 -0.0058422 0.0238226 -0.1766788 -0.012747 -0.0105283 -0.5454554 0.1364269 -0.0266019 0.0981812 -0.0010054 0.0224834 1.4501234 0.2185115 -0.0338959 0.5077942 0.0820899 0.0596241 -0.0894382 0.0207197 0.0933596 0.3432576 0.3269281 -0.0365824 0.8095484 0.2303875 -0.0685376 0.0779922 -0.0542609 -0.129639 -0.5153416 -0.0952835 0.0034303 0.1302149 0.0059315 -0.0431443 -0.0502226 -0.0490039 -0.2608395 -0.1010639 -0.0191375 -0.0045574 0.1356606 0.0627085 -0.0506047 -0.0451898 -0.0518228 -0.144699 0.067075 0.0100175 0.010677 0.1268596 0.0790417 -0.0442111 0.0012641 -0.048044 -0.1650813 -0.3899726 -0.0150439 -0.0055252 0.1513975 -0.0117035 0.0716134 0.0492318 0.0852883 -0.1080926 -0.2434668 -0.0336747 -0.0380867 -0.3121927 -0.125307 0.0547281 -0.0718837 0.0346623 -0.0960815 0.0622065 0.1014294 -0.0205233 0.0572177 0.0559863 -0.0494724 0.0037937 -0.0411969 -0.1791581 0.0107549 -0.0605549 0.0126624 -0.0789025 -0.1312171 -0.0076132 0.0142672 -0.0054418 -0.1798271 0.1173145 -0.016738 -0.0548373 -0.0293295 0.0247724 0.1113817 -0.1030081 0.1014044 -0.0625207 0.0971802 0.035547 -0.0262589 0.073575 0.0827348 0.1216391 0.008371 0.1229174 -0.0668516 -0.0599759 0.0558193 -0.01552 0.0371777 -0.1156262 0.013158 0.001242 0.0125121 -0.168279 0.0296175 0.0864397 -0.0210106 0.055303 0.0710441 0.0283795 -0.0239225 0.0257891 0.180922 0.0449941 -0.0781254 0.0143304 -0.039508 -0.0258905 0.0406048 -0.0201833 0.0346928 0.1884942 -0.0021995 -0.1013726 0.0193963 -0.0974202 0.0355773 0.0287351 0.0212973 0.0147117 0.1484662 -0.0538027 -0.0765566 0.0110188 -0.1170925 0.0084362 0.0265874 0.022735 0.0242993 0.1572701 0.09085 -0.0756945 -0.0212696 -0.0575634 0.0007924 -0.0931561 -0.039459 -0.0797401 0.1015424 0.0321116 0.0558398 0.0749106 0.0564124 0.0695818 -0.0546147 0.1014812 -0.0427119 0.0961094 0.0710761 0.028609 -0.0084333 0.0522234 -0.1189352 0.059545 -0.0155835 0.0550388 0.149585 -0.1320005 0.0825437 -0.0182841 0.0897402 0.0564769 0.0225708 -0.0208302 0.019577 0.1602311 -0.0292188 0.0642355 0.0758931 0.0765838 0.0421008 -0.0849197 0.0979364 -0.077479 0.0887631 0.0568171 -0.0421034 -0.0102149 -0.0707287 -0.0411968 -0.1098443 -0.0350427 -0.1053795 0.0929241 -0.1137239 -0.0679895 0.0191411 -0.0747706 0.086939 -0.0332624 0.0195484 -0.0254902 0.1471002 unknown
polarizability: 238.1614677|-2.1688997|160.1512997|-3.0537802|3.5907009|74.2904712 unknown
InChI: InChI=1S/C14H11N/c1-2-7-13(8-3-1)15-11-10-12-6-4-5-9-14(12)15/h1-11H
charge 0 multiplicity 1
26 atoms
N  -0.060424 0.670097 -0.121708
C  1.122035 -0.096338 0.012812
C  2.237347 0.80506 -0.126755
C  -1.411412 0.202126 -0.06421
C  0.310572 2.017423 -0.330285
C  1.694389 2.130741 -0.346107
C  1.304184 -1.468821 0.299217
C  3.558924 0.299006 -0.01412
C  -2.391636 0.968694 0.617065
C  -1.785732 -1.006916 -0.704761
C  2.627277 -1.943027 0.410505
C  3.744126 -1.071906 0.246813
C  -3.732003 0.529672 0.652078
C  -3.125761 -1.445398 -0.650551
C  -4.105832 -0.681565 0.024839
H  -0.454577 2.773449 -0.496146
H  2.256715 3.048607 -0.508222
H  0.457356 -2.144632 0.449723
H  4.419732 0.968523 -0.11998
H  -2.096285 1.887321 1.135242
H  -1.040979 -1.575407 -1.269879
H  2.798982 -3.002257 0.632349
H  4.757594 -1.478449 0.336742
H  -4.48145 1.127228 1.182604
H  -3.406644 -2.378253 -1.151767
H  -5.1455 -1.023777 0.059901
