program: Gaussian 09
title: 000182003
version: EM64L-G09RevD.01
frameworkgroup: C1[X(C8H18FO2P)]
method: RPBEPBE
basis: SDD
operation: Freq
keyword: #p
keyword: freq=noraman
keyword: PBEPBE/SDD
title: #p freq=noraman PBEPBE/SDD
converged: YES YES NO NO
title: Mulliken charges:
elementType: P F O O C C C C C C C C H H H H H H H H H H H H H H H H H H
charge: 1.341122 -0.404950 -0.560975 -0.610242 0.293772 -0.419867 0.042063 -0.707545 -0.719107 -0.716964 -0.719008 -0.920477 0.227092 0.194263 0.222845 0.240004 0.199786 0.207330 0.206420 0.212808 0.211357 0.211444 0.215484 0.206844 0.214469 0.266274 0.222857 0.280849 0.282891 0.279163
chargesum: 0.00000
title: Mulliken charges with hydrogens summed into heavy atoms:
elementType: P F O O C C C C C C C C
charge: 1.341122 -0.404950 -0.560975 -0.610242 0.293772 0.001488 0.264908 -0.060425 -0.088523 -0.083193 -0.015407 -0.077575
polarizability: 1.34310267e+02 -1.23920331e+00 1.14867997e+02 -6.42780422e-01 4.38717810e+00 1.00956114e+02
1716.lowfreq: -17.1718 -3.9879 -0.0018 -0.0017 -0.0015 7.3622 20.5838 26.2723 61.7332
frequency: 17.2797 25.6413 61.6920 78.9876 122.7892 137.1431 164.1697 191.0652 196.5022 213.7045 233.1061 243.3719 253.3770 260.6744 276.0855 303.6000 324.4624 330.0666 356.3200 379.2054 396.6199 430.8422 467.0384 517.8835 603.4802 661.1086 731.4207 734.2979 854.8925 867.3150 882.7088 923.8831 928.1823 939.4910 945.0026 953.1763 972.9027 1001.7139 1012.2896 1050.4446 1079.7282 1097.0018 1134.4762 1178.9095 1216.1045 1255.9903 1281.9809 1296.3793 1328.8288 1352.8697 1355.4221 1375.2400 1378.4717 1391.7986 1402.9876 1433.3088 1433.8971 1434.8437 1457.8987 1462.4225 1465.5380 1466.6078 1481.5156 1483.2906 1486.6510 1493.7657 2963.1161 2966.2973 2970.5122 2976.3644 2985.7024 3002.4747 3031.0511 3032.3402 3057.4997 3062.0062 3062.9419 3063.7566 3070.9781 3083.4617 3084.1549 3098.2107 3151.7180 3157.8732
redmass: 3.4683 3.8527 4.6658 3.4777 3.4357 1.0580 3.3267 1.1133 3.5331 2.2615 1.2291 1.8853 1.1087 1.6971 2.9273 3.0230 4.5472 2.4929 3.0012 3.4073 1.8823 3.0157 2.5435 3.1143 7.3287 5.3050 6.1314 3.2721 4.6560 1.8569 2.2981 1.6817 1.5955 1.2145 1.5359 1.9630 1.3634 1.4919 1.4126 1.5886 5.8100 2.1355 1.8002 1.6027 2.4618 2.9136 1.7480 1.3926 1.2414 1.3647 1.3232 1.2119 1.2010 1.2116 1.2062 1.0487 1.0437 1.0750 1.0496 1.0491 1.0475 1.0525 1.0507 1.0564 1.0597 1.0609 1.0351 1.0374 1.0509 1.0425 1.0366 1.0861 1.0318 1.1001 1.1001 1.0997 1.0989 1.0992 1.0981 1.0989 1.0986 1.1014 1.1021 1.1026
irintensity: 1.4128 3.0695 0.0548 1.9932 9.8671 0.3309 0.0845 0.7406 2.9784 1.7546 0.3145 1.4470 0.3201 1.0220 3.9191 6.5072 9.8453 9.3039 12.4351 25.2558 0.6865 7.1007 4.8116 8.2573 35.0265 57.9110 38.8148 0.2759 198.5443 34.3442 72.1007 3.0454 0.3839 0.1647 16.2166 25.7124 50.4104 9.6198 5.1600 26.0290 135.9390 4.3256 33.1368 17.7889 9.9475 16.1064 4.2803 4.2064 14.0713 14.3495 27.3698 18.4614 21.8527 22.7638 11.5202 18.4516 9.4195 1.1470 0.6879 1.9576 0.7210 8.2286 20.4536 3.3801 15.1952 26.6033 37.7547 26.7266 37.3776 8.5524 21.8217 14.4146 0.1302 16.3889 10.7164 11.4899 24.4617 48.8889 114.1605 21.8164 42.4750 13.1433 0.5412 0.6937
temp: 298.150 k
press: 1.00000 atm
elementType: 15 9 8 8 6 6 6 6 6 6 6 6 1 1 1 1 1 1 1 1 1 1 1 1 1 1 1 1 1 1
symmnumber: 1
zpe: 658486.4 jmol-1
zpe.correction: 0.250804 hartree
zpe.thermalcorrener: 0.267327 hartree
zpe.thermalcorrenthalpy: 0.268271 hartree
zpe.thermalcorrgfe: 0.206091 hartree
zpe.sumelectzpe: -906.177280 hartree
zpe.sumelectthermal: -906.160757 hartree
zpe.sumelectthermalent: -906.159813 hartree
zpe.sumelectthermalfe: -906.221993 hartree
dipole: -1.6236 -0.4805 -3.0188
dipole: 3.4612
quadrupole: -82.8844 -82.2201 -84.0991
quadrupole: -8.4119 -10.6424 1.9796
quadrupole: 0.1835 0.8478 -1.0312 -8.4119 -10.6424 1.9796
hfenergy: -906.428084 hartree
pointgroup: C01 [X(C8H18F1O2P1)]
dipole: -0.618049 0.4157851 1.1399386 debye
polarizability: 133.7159329|3.2814415|116.6247681|-1.8378067|0.1971411|99.7936762 unknown
InChI: InChI=1S/C8H18FO2P/c1-7(6-8(2,3)4)11-12(5,9)10/h7H,6H2,1-5H3
charge 0 multiplicity 1
30 atoms
P  2.254692 0.406936 -0.657473
F  1.586092 1.24935 -2.04781
O  0.840194 0.060531 0.243748
O  3.18027 -0.795106 -1.11653
C  -2.422712 0.069348 -0.345027
C  -1.421027 -0.78252 0.49751
C  -0.0552 -1.10685 -0.133789
C  -1.80256 1.422008 -0.783652
C  -3.66388 0.3454 0.547167
C  -2.877012 -0.724739 -1.600431
C  0.573314 -2.405687 0.389346
C  2.97125 1.809955 0.300665
H  -1.219823 -0.273418 1.461119
H  -1.91359 -1.745015 0.746125
H  -0.115695 -1.129246 -1.239731
H  -0.945404 1.284742 -1.465958
H  -2.560831 2.032572 -1.310342
H  -1.444127 1.996071 0.090611
H  -4.128129 -0.597656 0.894537
H  -4.42964 0.913335 -0.01373
H  -3.387588 0.938585 1.439609
H  -2.032217 -0.94576 -2.279422
H  -3.61704 -0.140968 -2.178979
H  -3.349218 -1.685075 -1.316942
H  -0.055914 -3.26656 0.096906
H  1.583114 -2.554684 -0.029873
H  0.640619 -2.385601 1.491833
H  3.780364 2.265428 -0.289771
H  2.181515 2.550965 0.490203
H  3.371279 1.431858 1.253182
