program: Gaussian 09
title: 000182015
version: EM64L-G09RevD.01
frameworkgroup: C1[X(C24H15NO3)]
method: RPBEPBE
basis: SDD
operation: Freq
keyword: #p
keyword: freq=noraman
keyword: PBEPBE/SDD
title: #p freq=noraman PBEPBE/SDD
converged: YES YES NO NO
title: Mulliken charges:
elementType: O O O N C C C C C C C C C C C C C C C C C C C C C C C C H H H H H H H H H H H H H H H
charge: -0.290087 -0.194616 -0.248908 -0.113971 0.030884 -0.512881 0.345600 0.257140 -0.536368 0.003999 -0.018482 0.272081 -0.583138 0.212370 -0.463412 0.428830 -0.503696 -0.350531 -0.451550 -0.259463 -0.250602 0.185857 0.234770 0.071222 -0.357833 -0.327721 -0.214932 -0.214073 0.243725 0.243332 0.254143 0.254159 0.360227 0.250490 0.241161 0.312802 0.243755 0.231801 0.232849 0.256159 0.259687 0.233349 0.231871
chargesum: 0.00000
title: Mulliken charges with hydrogens summed into heavy atoms:
elementType: O O O N C C C C C C C C C C C C C C C C C C C C C C C C
charge: -0.290087 -0.194616 -0.248908 -0.113971 0.030884 -0.025824 0.345600 0.257140 -0.028066 0.003999 -0.018482 0.272081 -0.222910 0.212370 -0.212922 0.428830 -0.262535 -0.037729 -0.207795 -0.027663 -0.017753 0.185857 0.234770 0.071222 -0.101674 -0.068034 0.018417 0.017798
polarizability: 4.10460561e+02 1.42227743e+01 4.04646749e+02 -2.05304304e-01 2.01717040e-02 1.08564732e+02
1716.lowfreq: -0.0009 -0.0008 -0.0006 2.4046 3.2389 3.4675 22.5101 25.1810 42.7069
frequency: 22.4795 25.1441 42.6974 51.0043 68.3737 84.3411 113.8074 138.1283 140.2284 165.1653 176.7899 219.0552 223.3865 246.9415 260.8290 288.8061 315.1442 328.3981 360.8569 408.1369 416.7774 425.9388 464.0704 479.0232 488.7919 501.5647 504.0404 539.6302 555.0991 563.5666 571.2935 596.2749 610.2504 617.9422 626.3218 637.1088 643.5004 648.0634 690.8082 705.6589 737.7317 740.8675 756.0155 757.8028 767.7523 798.9269 820.4972 829.5063 832.2412 851.9616 860.2146 868.3757 872.1037 886.7156 899.1294 929.0243 939.4663 953.6586 971.5214 980.2813 989.7008 998.8311 1003.0700 1003.5033 1004.8151 1006.2072 1034.3879 1059.9671 1082.3801 1101.4252 1136.3959 1137.1071 1146.4864 1163.0616 1177.7769 1181.4691 1189.6323 1201.8081 1204.7841 1234.6792 1246.2404 1251.3340 1268.0434 1274.2321 1281.9184 1297.3138 1307.1144 1369.9211 1390.6107 1399.6584 1404.3752 1411.7896 1425.8069 1435.4389 1437.8194 1449.9438 1458.6187 1463.0518 1506.3916 1530.7437 1538.5998 1581.3278 1601.3800 1615.7806 1619.2558 1623.6700 1628.9637 1636.4247 2987.9736 3018.4323 3033.1357 3075.4614 3123.7135 3128.9067 3138.9387 3141.4108 3157.9381 3159.0006 3159.8420 3161.3181 3177.6816 3184.1502 3243.6656
redmass: 5.6951 5.0438 6.3298 6.3338 4.6970 2.9025 2.5514 5.4917 6.8658 6.8036 8.0518 4.2660 6.6589 6.0947 4.2770 6.6269 5.9960 6.7107 5.0164 3.1953 7.0807 3.1555 6.0500 3.8032 6.2179 6.7321 3.3496 7.5670 3.2523 6.4433 3.9106 6.7925 7.1920 7.5967 3.8889 7.1812 7.2933 2.6718 6.2123 7.5047 2.8938 3.7055 5.8366 1.3497 1.2808 6.7743 2.2408 1.4983 6.5382 5.8435 1.3648 8.4497 2.3103 9.0860 1.6933 6.8159 1.3783 1.4493 1.3727 1.3038 1.4567 1.9698 2.8070 2.0776 4.7061 1.3494 3.3790 2.4859 3.5886 3.3161 2.0713 1.2125 1.9243 1.2642 1.3877 1.2458 1.9259 1.1142 3.0045 2.0572 1.4940 3.9038 1.7719 1.8505 1.5370 2.7331 2.6479 3.8096 5.6113 4.7202 8.7510 2.4440 2.1424 1.3267 3.1621 1.9670 2.6136 1.1991 3.5379 9.5491 5.5359 7.4466 8.3613 7.8464 6.5817 8.1059 7.7167 10.5806 1.0599 1.0618 1.1022 1.1015 1.0870 1.0870 1.0911 1.0865 1.0974 1.0919 1.0939 1.0993 1.0957 1.0991 1.0916
irintensity: 0.8689 1.0564 0.4471 0.7313 3.7662 0.1896 0.0053 1.6252 0.8516 0.0013 0.9055 2.0894 4.1116 0.0112 5.5475 0.7583 7.0572 0.0701 1.1884 3.9683 2.8951 9.3963 8.9940 0.0080 1.3051 0.4481 7.8781 4.1403 0.0022 11.4204 0.1333 2.3880 1.8788 8.3108 1.7429 0.9273 3.7561 1.5657 11.7129 34.4366 7.1196 6.7771 13.0238 96.8078 46.1932 43.6726 7.1248 68.5256 3.4840 2.1381 0.1220 20.3440 4.8459 42.9445 4.9737 7.8754 2.7829 30.3168 3.1053 0.0646 2.1138 0.2970 5.2089 28.7928 6.3725 0.2070 26.5802 3.3307 69.3085 48.2095 191.6331 0.0104 8.1483 8.7347 8.3907 23.3843 28.6053 0.0954 247.9272 8.1721 6.3083 30.8166 57.0770 28.4038 5.2558 155.1843 21.6049 69.4355 43.0762 5.1805 27.7525 20.5296 40.7948 32.2601 85.3559 7.8556 2.4389 4.0710 5.2643 845.2197 45.5062 91.8011 15.7732 73.3276 31.9860 0.1059 84.6105 270.0537 21.6653 16.2046 8.0363 10.9319 1.6819 4.5475 18.6179 3.4296 25.6012 28.2695 35.7284 34.1826 6.9723 11.1668 13.0301
temp: 298.150 k
press: 1.00000 atm
elementType: 8 8 8 7 6 6 6 6 6 6 6 6 6 6 6 6 6 6 6 6 6 6 6 6 6 6 6 6 1 1 1 1 1 1 1 1 1 1 1 1 1 1 1
symmnumber: 1
zpe: 845903.7 jmol-1
zpe.correction: 0.322188 hartree
zpe.thermalcorrener: 0.342980 hartree
zpe.thermalcorrenthalpy: 0.343924 hartree
zpe.thermalcorrgfe: 0.270989 hartree
zpe.sumelectzpe: -1202.108457 hartree
zpe.sumelectthermal: -1202.087664 hartree
zpe.sumelectthermalent: -1202.086720 hartree
zpe.sumelectthermalfe: -1202.159656 hartree
dipole: -2.1616 -2.9745 0.0206
dipole: 3.6770
quadrupole: -115.4860 -160.0666 -165.9397
quadrupole: -9.3299 -0.0190 0.0992
quadrupole: 31.6781 -12.9025 -18.7756 -9.3299 -0.0190 0.0992
hfenergy: -1202.4306445 hartree
pointgroup: C01 [X(C24H15N1O3)]
dipole: -0.7944455 -1.2066707 0.0748713 debye
polarizability: 409.1005874|14.3164257|405.1964973|-2.6240367|-15.3909031|109.3749571 unknown
InChI: InChI=1S/C24H15NO3/c26-20-12-11-16-17-10-9-14-5-1-2-6-15(14)23(17)22(13-18(16)20)28-24-25-19-7-3-4-8-21(19)27-24/h1-10,13H,11-12H2
charge 0 multiplicity 1
43 atoms
O  0.76409 -0.61391 -0.122544
O  -0.589702 4.713761 -0.393871
O  2.939725 -1.315325 -0.092921
N  2.619651 0.990646 -0.213778
C  -2.697132 1.818216 -0.221639
C  -3.799682 2.871515 -0.268535
C  -2.841868 0.400496 -0.146116
C  -1.425998 2.403029 -0.263472
C  -3.040881 4.228176 -0.342359
C  -1.667026 -0.455585 -0.112204
C  -1.534969 3.883938 -0.340463
C  -0.390507 0.231583 -0.158126
C  -0.246457 1.6195 -0.232324
C  -1.864219 -1.914086 -0.036076
C  -4.165867 -0.172104 -0.10407
C  -3.220843 -2.430121 0.002393
C  -4.349831 -1.534875 -0.032315
C  -0.80713 -2.885972 0.002842
C  -3.46088 -3.836887 0.074729
C  -1.070394 -4.261115 0.073587
C  -2.404572 -4.751027 0.110247
C  2.051039 -0.200622 -0.14875
C  4.21992 -0.69435 -0.130475
C  4.018274 0.712919 -0.204104
C  5.476512 -1.304047 -0.102584
C  5.126524 1.579614 -0.253687
C  6.584873 -0.42141 -0.152964
C  6.41163 0.98859 -0.226941
H  -4.458206 2.722806 -1.145196
H  -4.4486 2.814018 0.625833
H  -3.261599 4.888084 0.515902
H  -3.279913 4.803986 -1.254469
H  0.741402 2.086139 -0.264959
H  -5.02628 0.503796 -0.1304
H  -5.357819 -1.964208 -0.000733
H  0.227601 -2.556055 -0.022828
H  -4.499411 -4.187362 0.101356
H  -0.23027 -4.963612 0.10059
H  -2.59867 -5.827498 0.165287
H  5.599356 -2.388457 -0.04572
H  4.990315 2.662979 -0.310185
H  7.597496 -0.837478 -0.134465
H  7.297019 1.631911 -0.26389
