program: Gaussian 09
title: 000181980
version: EM64L-G09RevD.01
frameworkgroup: C1[X(C8H7ClO2)]
method: RPBEPBE
basis: SDD
operation: Freq
keyword: #p
keyword: freq=noraman
keyword: PBEPBE/SDD
title: #p freq=noraman PBEPBE/SDD
converged: YES YES NO NO
title: Mulliken charges:
elementType: Cl O O C C C C C C C C H H H H H H H
charge: -0.054246 -0.266228 -0.200908 0.386431 0.212701 -0.354827 -0.326884 -0.809852 -0.102850 -0.211722 -0.006314 0.262889 0.257361 0.230168 0.274119 0.235279 0.262053 0.212831
chargesum: 0.00000
title: Mulliken charges with hydrogens summed into heavy atoms:
elementType: Cl O O C C C C C C C C
charge: -0.054246 -0.266228 -0.200908 0.386431 0.212701 -0.091938 -0.069523 -0.070286 -0.102850 0.050331 0.206517
polarizability: 1.45093212e+02 1.21423924e+00 9.63539189e+01 -4.57415209e+00 2.92587694e+00 5.49938028e+01
1716.lowfreq: -7.6121 -2.9993 0.0003 0.0009 0.0026 8.8640 54.8743 80.7859 149.6779
frequency: 54.8717 80.7768 149.6766 168.3245 196.5503 199.3962 233.8626 313.1702 340.1266 360.7200 441.0992 454.2552 530.8504 549.3025 600.3021 682.7385 712.1726 752.7303 824.6483 854.9408 876.8819 945.6666 963.0263 996.8400 1030.0835 1049.6740 1082.7327 1097.3070 1153.4362 1222.2460 1261.2481 1346.0718 1372.8600 1391.5130 1399.3871 1461.4810 1467.5311 1483.4416 1576.2560 1611.8585 1640.8210 2985.5418 3051.3932 3068.0406 3097.7178 3160.0102 3163.2634 3183.7382
redmass: 9.1615 6.8174 2.5484 1.8080 2.8962 3.1844 3.3655 4.9820 5.2453 8.2165 3.3456 3.8870 4.5980 4.2371 6.6781 4.4457 5.5662 3.8401 1.6072 5.8862 1.3553 1.3592 1.5692 1.5582 7.4336 1.5373 1.9235 2.7610 1.6589 3.1082 1.2838 1.1338 6.9329 3.6156 1.2423 1.7669 1.3077 1.1539 6.1671 8.2773 8.9534 1.0369 1.0929 1.0976 1.0994 1.0927 1.0891 1.0980
irintensity: 1.1682 0.9419 3.0748 0.9235 8.3048 0.5244 2.8294 7.8602 7.1520 10.5610 13.3775 3.4420 2.2190 5.5323 6.9591 3.5796 1.4779 7.2068 42.9688 57.3426 19.4048 0.4447 3.4362 3.7642 187.1883 13.6869 30.5186 188.4960 88.6107 3.1870 0.3593 7.2509 5.9246 10.9860 16.6320 60.5780 38.6158 51.8001 9.4638 7.2517 243.8182 15.5472 54.4615 8.8863 15.4429 2.0447 1.3629 1.6905
temp: 298.150 k
press: 1.00000 atm
elementType: 17 8 8 6 6 6 6 6 6 6 6 1 1 1 1 1 1 1
symmnumber: 1
zpe: 338785.9 jmol-1
zpe.correction: 0.129037 hartree
zpe.thermalcorrener: 0.139432 hartree
zpe.thermalcorrenthalpy: 0.140376 hartree
zpe.thermalcorrgfe: 0.092369 hartree
zpe.sumelectzpe: -918.755433 hartree
zpe.sumelectthermal: -918.745037 hartree
zpe.sumelectthermalent: -918.744093 hartree
zpe.sumelectthermalfe: -918.792100 hartree
dipole: 1.3713 -0.3011 -1.6365
dipole: 2.1562
quadrupole: -71.6081 -61.3235 -77.5444
quadrupole: -0.4054 -5.0402 -1.6343
quadrupole: -1.4494 8.8352 -7.3857 -0.4054 -5.0402 -1.6343
hfenergy: -918.8844693 hartree
pointgroup: C01 [X(C8H7Cl1O2)]
dipole: -0.5398037 -0.01711 -0.6541945 debye
dipolederiv: -0.8420976 0.0113231 -0.1026045 0.0495862 -0.1298079 0.0157811 -0.1305913 0.0123106 -0.0878501 -1.6705929 -0.0084269 0.3834714 -0.0538006 -0.273705 0.0842432 0.3561286 0.0780017 -0.6248389 -0.4983765 0.0354147 -0.0673259 -0.1379565 -0.3227373 0.1460638 0.56579 0.1000334 -0.892933 0.0348729 0.1904768 0.0190085 0.1628856 0.2057802 0.0054336 -0.0565282 -0.0343767 -0.0072509 1.0084618 -0.0426532 -0.0496006 -0.1848017 0.0667939 0.0201478 0.2126127 0.0007531 -0.0221428 -0.3480047 -0.1444411 -0.0044418 -0.0352472 -0.0589393 -0.0336104 -0.0270209 -0.0438526 -0.1077376 -0.0734201 -0.0041636 0.0650175 0.0162688 0.01514 -0.0427744 -0.0005231 -0.0228153 -0.0985106 -0.0758827 -0.1492834 0.0172823 -0.0816337 -0.0469772 0.0127085 0.0457309 0.062214 0.0224385 1.2270714 -0.0297271 0.1882915 -0.100593 0.1511146 -0.0450109 0.2257624 -0.0387944 -0.0175131 -0.3179376 0.0591221 -0.0243973 0.0786321 -0.0433965 0.0008921 -0.0370137 -0.0035642 -0.1266454 1.4695393 -0.0403546 -0.2941809 0.2323464 0.2358697 -0.2924253 -0.958738 -0.2077294 1.3675413 0.0691848 0.0360341 -0.0150603 0.0485218 -0.0143783 0.0340217 -0.0228349 0.0315539 0.1510334 0.0593014 0.0612418 -0.0368459 0.0574494 -0.0043443 0.0335329 -0.0273948 0.0379682 0.1556763 0.0091094 0.1501268 0.0034969 0.0547805 -0.0637441 -0.0095152 -0.0100596 -0.0120664 0.1205773 0.0429417 -0.0479562 0.0758323 -0.0335975 0.0777827 -0.0268302 0.0847574 0.0136476 -0.0051752 0.0017692 -0.0406388 -0.1047754 -0.0313622 0.0597437 0.0388271 -0.1138295 -0.0313628 -0.0117427 0.0404245 -0.0695638 -0.0011107 -0.0627214 0.0175093 0.0184569 -0.006138 0.0178238 0.1662736 -0.1363643 0.0334691 -0.0520574 0.0212429 0.128296 0.0400578 -0.10011 0.0402556 0.0187999 unknown
polarizability: 144.7992256|4.3630534|94.5164027|4.689607|-9.4028806|57.1253057 unknown
InChI: InChI=1S/C8H7ClO2/c1-6-4-7(9)2-3-8(6)11-5-10/h2-5H,1H3
charge 0 multiplicity 1
18 atoms
Cl 3.9447 -0.006151 0.347307
O  -1.969263 0.45609 -0.756894
O  -2.772774 -0.088019 1.395431
C  -0.034513 -0.974932 -0.119976
C  -0.574746 0.301061 -0.421633
C  1.363487 -1.039103 0.113319
C  0.215503 1.462236 -0.509891
C  -0.890879 -2.221581 -0.052693
C  2.151923 0.124071 0.03859
C  1.604721 1.38253 -0.274985
C  -2.957763 0.245263 0.215274
H  1.827209 -2.001452 0.350156
H  -0.256696 2.415993 -0.762283
H  -0.267483 -3.13042 -0.071842
H  -1.488954 -2.231519 0.877077
H  -1.599217 -2.27029 -0.899682
H  2.236976 2.271984 -0.33489
H  -3.93443 0.43144 -0.268785
