program: Gaussian 09
title: 000181976
version: EM64L-G09RevD.01
frameworkgroup: C1[X(C5H8O5)]
method: RPBEPBE
basis: SDD
operation: Freq
keyword: #p
keyword: freq=noraman
keyword: PBEPBE/SDD
title: #p freq=noraman PBEPBE/SDD
converged: YES YES NO NO
title: Mulliken charges:
elementType: O O O O O C C C C C H H H H H H H H
charge: -0.464417 -0.398758 -0.408813 -0.267165 -0.243606 -0.038244 -0.518798 -0.520742 0.207251 0.185548 0.221861 0.259951 0.299556 0.264861 0.289926 0.370094 0.383056 0.378437
chargesum: 0.00000
title: Mulliken charges with hydrogens summed into heavy atoms:
elementType: O O O O O C C C C C
charge: -0.094323 -0.015702 -0.030376 -0.267165 -0.243606 0.183617 0.040710 0.034045 0.207251 0.185548
polarizability: 8.64710707e+01 1.25543640e+00 7.05872755e+01 4.91653220e+00 4.14794354e-01 4.96216288e+01
1716.lowfreq: -13.1395 -8.1817 -0.0011 -0.0008 -0.0007 10.3050 38.9747 49.9026 76.6491
frequency: 38.9724 49.8600 76.6298 96.3038 164.8806 201.8758 285.0353 322.7681 376.2648 439.7298 488.1732 505.5230 530.6677 588.2422 591.6629 627.4143 646.4178 663.6588 830.8627 866.5877 873.9151 912.5953 1016.0989 1040.6124 1055.2559 1075.1123 1110.6180 1165.2775 1220.9930 1240.7498 1252.3564 1273.3425 1329.5645 1349.4797 1364.2146 1413.2487 1424.2255 1435.5413 1637.1929 1658.4826 2968.9180 2999.2249 3011.8288 3067.2721 3074.7667 3463.7323 3506.0812 3514.1339
redmass: 10.5058 8.0558 3.9469 4.3838 3.3252 6.2465 5.7514 6.3431 6.7756 1.8530 3.5741 1.8954 2.3907 4.0875 1.0873 2.7269 1.4232 1.6992 3.1332 2.7341 4.4315 2.6173 2.9846 2.7993 2.4868 2.0319 1.9889 1.2780 1.2445 1.4091 1.5142 1.2129 1.2966 2.0096 2.0273 1.8020 1.1094 1.0910 7.3233 8.0336 1.0840 1.0638 1.0620 1.0977 1.0962 1.0651 1.0639 1.0640
irintensity: 1.1313 0.5658 0.6440 4.3574 5.5109 3.3308 1.1658 5.5558 0.5542 9.5543 65.2348 13.9154 87.8414 35.4312 166.9345 23.3218 141.6426 137.4104 11.8180 2.8968 18.7302 2.6311 159.8819 62.1480 96.0977 267.2069 79.1743 9.2737 18.9722 9.8331 15.9949 32.7798 7.0416 117.3577 57.3834 70.6634 42.2655 36.0819 197.9408 214.3957 33.6762 13.7125 8.0931 5.8248 3.4920 74.3154 22.7627 26.0922
temp: 298.150 k
press: 1.00000 atm
elementType: 8 8 8 8 8 6 6 6 6 6 1 1 1 1 1 1 1 1
symmnumber: 1
zpe: 351979.4 jmol-1
zpe.correction: 0.134062 hartree
zpe.thermalcorrener: 0.144637 hartree
zpe.thermalcorrenthalpy: 0.145581 hartree
zpe.thermalcorrgfe: 0.096463 hartree
zpe.sumelectzpe: -570.675534 hartree
zpe.sumelectthermal: -570.664959 hartree
zpe.sumelectthermalent: -570.664015 hartree
zpe.sumelectthermalfe: -570.713133 hartree
dipole: 0.1457 -1.6693 0.6948
dipole: 1.8140
quadrupole: -45.7220 -66.1238 -58.9123
quadrupole: 2.2410 -1.1130 -1.9316
quadrupole: 11.1974 -9.2044 -1.9930 2.2410 -1.1130 -1.9316
hfenergy: -570.8095963 hartree
pointgroup: C01 [X(C5H8O5)]
dipole: -0.0267109 -0.4099548 -0.583564 debye
dipolederiv: -0.5899714 -0.1170735 0.1442846 -0.08927 -0.496482 -0.1186165 0.1271342 -0.1422365 -0.7279495 -0.7172047 -0.2754241 -0.4709495 -0.2485329 -0.450443 -0.1618478 -0.4657029 -0.1777417 -0.8410869 -1.274064 0.308348 -0.1059536 0.3268191 -0.5336998 -0.0049088 -0.0228039 -0.0302588 -0.2488519 -0.700394 0.2018678 0.0958911 0.0510799 -0.6246247 -0.3705102 -0.1891668 -0.28195 -0.7477955 -0.7526261 0.1244571 0.0321591 0.1714361 -0.3971183 0.1342369 -0.2348319 0.2181046 -0.8378741 0.5282164 0.0650925 -0.128958 0.0810551 0.363705 0.0976308 -0.0592386 0.0317658 0.5456882 -0.3729263 0.0970668 -0.080074 0.1981345 -0.069624 -0.1223825 0.0120112 -0.1139561 -0.1176771 -0.1314417 0.0470118 0.0778751 -0.0000351 0.0901969 0.0309162 0.1460053 0.0169484 -0.2789177 1.2488191 -0.1600168 0.3049191 -0.0918923 0.7154644 0.5920968 0.5043703 0.54837 1.1173563 1.5881523 -0.4560534 -0.0399111 -0.5135871 0.4188286 -0.2010896 0.0523715 -0.2456759 1.0999841 0.0128003 -0.0088206 0.0192932 -0.0546987 -0.1367769 0.0749175 0.0043613 0.0756935 -0.0582209 0.0592375 -0.0039072 -0.01563 -0.0414967 -0.0353838 0.0284008 -0.0095803 0.0720476 0.1002167 0.1683382 0.0040962 0.0084029 0.0108987 0.1184624 -0.0039481 -0.0058845 -0.01073 -0.0170599 0.0878386 -0.0152533 0.04683 0.0250904 -0.0503135 0.0346925 0.0082963 0.0263125 0.1100889 0.0046112 -0.0456341 -0.0358234 -0.0442691 0.090726 -0.0573474 -0.0749671 -0.0361383 0.073428 0.308612 0.1177225 0.074352 0.0808485 0.3193567 0.0486913 0.0544116 0.0853399 0.3939327 0.1920762 0.102575 0.0409659 0.1365188 0.3012661 -0.0555549 0.074251 -0.0750445 0.3341362 0.3399265 0.0139451 0.0323264 0.0019006 0.37646 0.0546229 0.078963 0.0391494 0.1006024 unknown
polarizability: 85.2071049|-8.3508602|51.9293288|1.7543137|4.1903154|69.5435413 unknown
InChI: InChI=1S/C5H8O5/c6-3(1-4(7)8)2-5(9)10/h3,6-7,9H,1-2H2
charge 0 multiplicity 1
18 atoms
O  -0.489881 0.257603 1.978673
O  -3.150706 -0.514322 -1.340909
O  3.447172 -0.91935 -0.428907
O  -2.825253 0.822498 0.519671
O  1.767945 0.01352 -1.727152
C  -0.009232 0.224077 0.593504
C  -0.965325 -0.576697 -0.322542
C  1.386087 -0.409275 0.688794
C  -2.367073 -0.006733 -0.308819
C  2.161331 -0.396076 -0.610147
H  0.080269 1.254391 0.187579
H  -1.026977 -1.628718 0.020959
H  -0.588203 -0.588741 -1.35999
H  1.309723 -1.450178 1.056858
H  1.968212 0.134247 1.45545
H  -1.38657 0.69327 1.962038
H  -4.069307 -0.132443 -1.283415
H  3.935788 -0.898373 -1.296546
