program: Gaussian 09
title: 000181975
version: EM64L-G09RevD.01
frameworkgroup: C1[X(C6H4ClFO)]
method: RPBEPBE
basis: SDD
operation: Freq
keyword: #p
keyword: freq=noraman
keyword: PBEPBE/SDD
title: #p freq=noraman PBEPBE/SDD
converged: NO NO NO NO
title: Mulliken charges:
elementType: Cl F O C C C C C C H H H H
charge: -0.048730 -0.215466 -0.419158 0.132225 0.228111 -0.284174 -0.305469 -0.193409 -0.078856 0.264274 0.283055 0.260817 0.376780
chargesum: 0.00000
title: Mulliken charges with hydrogens summed into heavy atoms:
elementType: Cl F O C C C C C C
charge: -0.048730 -0.215466 -0.042379 0.132225 0.228111 -0.019900 -0.022414 0.067408 -0.078856
polarizability: 1.14232897e+02 -2.19910772e+00 7.75334044e+01 9.35330586e-04 4.74994997e-03 2.98834605e+01
1716.lowfreq: -7.5224 -0.0029 -0.0029 -0.0023 8.4242 9.1513 122.0109 209.1635 222.0002
frequency: 122.0100 209.1631 222.0002 268.9451 327.8178 356.1741 425.5240 439.1044 440.5586 549.6126 557.1462 629.2726 679.4088 752.4816 808.3609 844.8455 854.6741 934.9102 1056.4271 1083.9043 1158.4243 1169.7988 1232.3781 1304.9947 1392.0553 1412.2224 1478.9071 1599.1577 1614.3116 3167.1868 3183.9338 3186.8739 3552.7419
redmass: 8.4764 6.6309 11.7415 7.3612 7.2544 15.1240 1.1139 3.0039 6.1888 6.5569 4.6703 8.1696 4.0925 6.3704 1.3891 1.3866 7.5240 1.3212 1.8830 2.5568 1.3696 2.0062 1.6504 2.0813 4.2864 4.3200 3.3622 7.4576 7.8034 1.0889 1.0944 1.0968 1.0656
irintensity: 0.0084 0.0000 0.7380 9.7525 0.0062 3.1184 174.4423 0.0233 4.3308 8.9561 16.2419 24.5409 0.0375 47.1466 33.9795 43.2348 44.3226 0.2525 7.3195 22.1148 22.6929 233.2292 13.6855 20.5309 38.3389 3.5292 216.7600 18.3660 1.0895 1.3602 0.1673 1.9770 79.3287
temp: 298.150 k
press: 1.00000 atm
elementType: 17 9 8 6 6 6 6 6 6 1 1 1 1
symmnumber: 1
zpe: 221400.8 jmol-1
zpe.correction: 0.084327 hartree
zpe.thermalcorrener: 0.092093 hartree
zpe.thermalcorrenthalpy: 0.093038 hartree
zpe.thermalcorrgfe: 0.051585 hartree
zpe.sumelectzpe: -865.506785 hartree
zpe.sumelectthermal: -865.499019 hartree
zpe.sumelectthermalent: -865.498075 hartree
zpe.sumelectthermalfe: -865.539528 hartree
dipole: -0.8450 0.2656 0.0000
dipole: 0.8858
quadrupole: -59.1548 -54.8192 -60.2833
quadrupole: 2.5774 0.0003 0.0005
quadrupole: -1.0690 3.2665 -2.1976 2.5774 0.0003 0.0005
hfenergy: -865.5911121 hartree
pointgroup: C01 [X(C6H4Cl1F1O1)]
dipole: -0.3286291 0.1159981 0.0000061 debye
dipolederiv: -0.7617504 0.1188908 -0.0000003 0.1330408 -0.1485477 -0.0000064 0.0000006 -0.0000064 -0.0604612 -0.6288942 -0.3844393 -0.0000487 -0.424844 -0.6599665 -0.0000613 -0.0000524 -0.0000611 -0.1364817 -1.462716 0.1656795 -0.0000004 0.1701566 -0.1107507 0.0000333 -0.0000004 0.0000327 -0.4101824 1.3224158 -0.141834 0.0000052 -0.2957338 -0.0957349 -0.0000214 -0.00001 -0.0000176 0.0649187 0.420035 0.3210308 0.0000417 0.6603044 0.7123127 0.0000804 0.0000759 0.0000757 0.0425451 -0.1445693 0.0848466 0.0000092 -0.1288284 0.0757812 0.0000205 -0.0000123 0.0000235 -0.1523452 -0.2818182 0.028694 -0.0000011 0.0272208 -0.0837982 -0.0000001 -0.0000009 -0.0000017 -0.0866457 -0.1932112 0.0045695 -0.0000018 0.1187218 0.0251543 0.0000151 0.0000088 0.0000132 -0.1128907 1.0759663 -0.1779509 0.0000028 -0.2377415 0.1024401 0.0000155 -0.0000026 0.0000166 -0.0935747 0.0628036 0.0509619 0.0000032 0.0458173 -0.0050026 -0.0000171 0.0000031 -0.000017 0.1776985 0.1032805 0.0289939 0.0000012 0.0211751 0.0312965 -0.0000151 0.0000002 -0.0000145 0.1911167 0.0399359 -0.0709582 -0.000009 -0.0645343 0.0327955 -0.0000147 -0.0000078 -0.0000146 0.1728055 0.4485223 -0.0284847 -0.0000019 -0.0247547 0.1240201 -0.0000288 -0.0000023 -0.0000287 0.403497 unknown
polarizability: 114.0359047|-3.467965|77.7303966|0.0010998|0.0047146|29.8834605 unknown
InChI: InChI=1S/C6H4ClFO/c7-4-1-2-6(9)5(8)3-4/h1-3,9H
charge 0 multiplicity 1
13 atoms
Cl 3.32688 -0.392676 0.000024
F  -1.693969 -1.8471 -0.000214
O  -2.590564 0.804585 0.000044
C  -1.223333 0.516267 0.000037
C  -0.729311 -0.808665 -0.000089
C  -0.287996 1.573331 0.000157
C  0.635245 -1.119016 -0.000095
C  1.097499 1.300612 0.000153
C  1.540268 -0.038946 0.000028
H  -0.660246 2.601336 0.000251
H  0.967131 -2.16029 -0.000189
H  1.819921 2.121124 0.000244
H  -3.120325 -0.034161 -0.00005
