program: Gaussian 09
title: 000181969
version: EM64L-G09RevD.01
frameworkgroup: C1[X(C16H14N2O3)]
method: RPBEPBE
basis: SDD
operation: Freq
keyword: #p
keyword: freq=noraman
keyword: PBEPBE/SDD
title: #p freq=noraman PBEPBE/SDD
converged: YES YES NO NO
title: Mulliken charges:
elementType: O O O N N C C C C C C C C C C C C C C C C H H H H H H H H H H H H H H
charge: -0.222986 -0.383271 -0.287658 -0.155922 -0.232562 0.130090 0.372028 0.181644 -0.309399 -0.309749 0.059417 0.101524 -0.352112 -0.393488 -0.251876 -0.736502 -0.236393 -0.249570 -0.291880 -0.289455 0.106257 0.272180 0.245370 0.299081 0.262712 0.295013 0.242339 0.239386 0.232335 0.245960 0.269299 0.273982 0.247557 0.249050 0.377597
chargesum: 0.00000
title: Mulliken charges with hydrogens summed into heavy atoms:
elementType: O O O N N C C C C C C C C C C C C C C C C
charge: -0.222986 -0.005674 -0.287658 -0.155922 -0.232562 0.130090 0.372028 0.181644 0.208152 -0.010668 0.059417 0.101524 -0.089400 -0.098474 -0.009537 -0.018821 0.032906 0.024412 -0.044323 -0.040405 0.106257
polarizability: 2.82264977e+02 8.08748397e+00 2.14569880e+02 7.41693762e+00 -8.31903872e+00 1.11651563e+02
1716.lowfreq: -7.1341 -4.8694 0.0004 0.0007 0.0008 8.1797 20.0850 36.7146 48.5922
frequency: 20.0824 36.7104 48.5770 60.0363 80.7879 89.4721 123.0110 141.1658 153.8550 198.5211 236.9217 248.3928 282.8698 304.9065 323.3129 332.2652 342.9079 366.6180 397.2902 401.8138 467.0407 468.8946 528.3224 543.9747 570.3180 592.5215 607.2920 611.4036 620.4239 652.5395 693.1884 698.4316 708.7053 733.7933 739.1011 771.5593 785.5626 794.4887 809.8450 832.0213 836.9876 861.7431 881.1887 881.3784 944.6902 947.8112 957.2112 961.7105 1008.8844 1025.8001 1041.5771 1059.0945 1067.0797 1083.2933 1088.1550 1105.9765 1118.6162 1128.7861 1161.9173 1196.0717 1230.1580 1235.1998 1250.2788 1292.7866 1305.7772 1320.8953 1330.8187 1342.7152 1370.7431 1388.8311 1398.0836 1406.1965 1416.8680 1423.2134 1455.7404 1474.4839 1480.3147 1483.1795 1494.1450 1509.7513 1561.2336 1566.0201 1589.1888 1605.1970 1630.6263 2993.0849 3019.9245 3071.5439 3090.1949 3100.2934 3144.6328 3155.1897 3172.3739 3189.8794 3205.5531 3216.8786 3231.4907 3245.5249 3493.8679
redmass: 4.4954 9.5557 8.9107 3.7181 2.8000 3.9485 3.0505 4.4184 5.6349 4.3045 4.2509 6.3334 3.0866 5.3162 2.3989 6.1822 1.9903 7.6323 5.9131 5.2773 4.3789 4.4811 5.4625 4.5300 3.6577 4.3264 3.0382 1.4338 4.7124 4.5373 5.7578 5.4941 1.2814 1.2063 4.1683 4.6810 2.3886 5.5944 1.1639 1.7542 1.6202 5.6727 1.7998 2.8754 2.9410 1.4491 3.0332 1.3917 1.3448 2.6744 1.8652 1.3231 2.7008 1.6969 1.5061 2.3413 3.0917 1.5767 1.4587 1.7390 2.4110 2.8897 1.3432 1.2497 2.8906 2.4639 2.0774 2.2800 7.5905 2.8820 3.3476 1.5953 2.0749 2.8323 3.2553 1.1222 1.1936 2.7860 1.0636 4.3783 7.2410 6.7386 7.4482 7.2323 7.5953 1.0368 1.0602 1.1034 1.0979 1.1030 1.0869 1.0921 1.0999 1.0911 1.0884 1.0936 1.1020 1.1120 1.0635
irintensity: 0.2600 3.6914 2.5878 0.5552 0.3433 0.3653 1.1195 2.4326 1.4398 1.0888 1.3296 0.7814 1.7462 5.0664 1.2983 3.1119 1.3705 6.0561 4.2902 4.5962 7.4699 9.5752 14.8339 18.4517 7.1524 44.7049 1.4571 90.5506 16.2075 24.0187 19.5802 30.2454 1.5299 151.2394 4.8539 9.0475 73.6524 9.8417 3.8939 6.9026 6.3158 0.1586 3.0484 5.9838 36.8847 3.7972 0.6277 21.5827 1.7620 78.9394 14.9688 43.1723 215.7634 18.4485 146.9029 15.1106 17.1098 0.7968 10.4833 12.7472 11.5986 20.9820 0.5310 3.3733 14.6686 9.3216 263.9073 11.5475 13.3412 23.3541 14.4694 15.0307 12.6958 80.0220 34.3783 26.9449 16.6447 40.2859 18.5598 0.5099 95.7105 300.7463 286.3846 22.0456 259.8109 12.9714 3.0583 1.1999 23.0317 24.8099 5.9740 0.3563 14.7150 3.5707 3.4844 1.5965 0.5799 2.5277 36.2105
temp: 298.150 k
press: 1.00000 atm
elementType: 8 8 8 7 7 6 6 6 6 6 6 6 6 6 6 6 6 6 6 6 6 1 1 1 1 1 1 1 1 1 1 1 1 1 1
symmnumber: 1
zpe: 703821.7 jmol-1
zpe.correction: 0.268072 hartree
zpe.thermalcorrener: 0.286038 hartree
zpe.thermalcorrenthalpy: 0.286982 hartree
zpe.thermalcorrgfe: 0.220580 hartree
zpe.sumelectzpe: -951.796117 hartree
zpe.sumelectthermal: -951.778150 hartree
zpe.sumelectthermalent: -951.777206 hartree
zpe.sumelectthermalfe: -951.843608 hartree
dipole: -5.4699 -1.6861 -0.8475
dipole: 5.7862
quadrupole: -130.8146 -119.0219 -118.5988
quadrupole: -3.9328 3.4667 0.2521
quadrupole: -8.0028 3.7899 4.2130 -3.9328 3.4667 0.2521
hfenergy: -952.0641881 hartree
pointgroup: C01 [X(C16H14N2O3)]
dipole: 2.1253762 0.7238682 -0.3757057 debye
polarizability: 280.8741326|10.6820192|212.2955124|-15.2840518|17.4073923|115.3167751 unknown
InChI: InChI=1S/C16H14N2O3/c1-2-17-10-12(16(20)21)15(19)11-6-5-7-13(14(11)17)18-8-3-4-9-18/h3-10,20H,2H2,1H3
charge 0 multiplicity 1
35 atoms
O  -3.186329 -1.988275 -0.014903
O  -4.886093 0.071862 0.821586
O  -4.011881 2.213192 0.798357
N  -0.162515 0.925919 -0.001865
N  2.709444 -0.080534 0.102639
C  0.208005 -0.450037 -0.10176
C  1.565702 -0.919232 -0.159672
C  -0.843442 -1.425896 -0.147115
C  0.815391 2.032192 -0.32019
C  -1.472403 1.243593 0.244871
C  -2.296392 -1.081983 0.060186
C  -2.53036 0.340483 0.338682
C  1.830426 -2.283605 -0.396325
C  -0.539266 -2.790507 -0.37542
C  0.784568 -3.222797 -0.538107
C  0.175144 3.399177 -0.599194
C  3.688638 0.294416 -0.829609
C  3.068382 0.415593 1.365942
C  4.660003 1.045839 -0.158477
C  4.27002 1.120079 1.2275
C  -3.835503 0.967893 0.659907
H  1.540334 2.122036 0.506103
H  1.377852 1.708476 -1.211478
H  -1.710682 2.301502 0.366638
H  2.878358 -2.600106 -0.426015
H  -1.390076 -3.479022 -0.411932
H  1.01244 -4.276292 -0.725869
H  -0.583909 3.356102 -1.400168
H  -0.279601 3.856829 0.296587
H  0.980672 4.076699 -0.933671
H  3.60344 0.002026 -1.874371
H  2.459649 0.200657 2.242038
H  5.548524 1.483554 -0.610952
H  4.810299 1.616479 2.032189
H  -5.704337 0.59979 1.036469
