program: Gaussian 09
title: 000181961
version: EM64L-G09RevD.01
frameworkgroup: C1[X(C10H17NO5S)]
method: RPBEPBE
basis: SDD
operation: Freq
keyword: #p
keyword: freq=noraman
keyword: PBEPBE/SDD
title: #p freq=noraman PBEPBE/SDD
converged: YES YES NO NO
title: Mulliken charges:
elementType: S O O O O O N C C C C C C C C C C H H H H H H H H H H H H H H H H H
charge: 0.940403 -0.278677 -0.411508 -0.223304 -0.564874 -0.580174 -0.167524 -0.137076 -0.476205 -0.372034 -0.473037 -0.147749 0.228878 -0.649817 0.188910 -0.678283 -0.737441 0.309986 0.239273 0.250194 0.245228 0.240693 0.247044 0.237970 0.278026 0.279616 0.295667 0.232120 0.219109 0.261656 0.293258 0.263498 0.265232 0.380942
chargesum: 0.00000
title: Mulliken charges with hydrogens summed into heavy atoms:
elementType: S O O O O O N C C C C C C C C C C
charge: 0.940403 -0.278677 -0.030566 -0.223304 -0.564874 -0.580174 -0.167524 0.172910 0.013262 0.113887 0.011978 0.130277 0.228878 -0.074534 0.188910 0.034601 0.084547
polarizability: 1.86776711e+02 4.42473645e+00 1.41514404e+02 -1.26359016e+00 6.95728025e-01 1.32705490e+02
1716.lowfreq: -8.5375 -5.9287 -0.0019 -0.0019 -0.0016 6.6137 22.3982 28.4668 34.6142
frequency: 22.2172 28.0810 34.5166 51.8284 57.3522 75.2807 93.5499 126.2200 133.9669 146.1270 163.7050 179.1164 190.3007 197.6063 237.1642 246.0084 254.3246 265.3863 309.0620 323.0666 337.6502 357.7613 389.7680 434.0937 526.9568 529.5020 554.1965 584.2653 599.2414 626.9681 694.8542 709.9340 728.3087 785.6950 793.3193 822.8079 836.0834 867.8742 879.8709 898.0395 911.6699 920.9885 966.0591 967.8014 981.5896 995.4206 1044.0930 1049.5457 1051.9916 1063.6962 1098.0967 1122.6914 1151.1813 1164.7364 1187.9310 1189.9787 1219.1293 1238.3010 1251.3862 1261.6856 1291.1882 1300.1762 1303.3303 1326.3886 1335.0569 1337.9613 1358.6329 1385.6459 1403.5910 1410.6789 1413.6241 1425.2420 1469.8454 1472.5267 1474.9452 1480.8614 1490.2556 1568.5226 1668.0693 2983.3482 2984.2551 2991.1500 3020.7968 3026.0472 3028.5299 3052.3563 3063.4279 3068.1756 3091.4043 3093.1798 3095.8689 3103.6214 3148.8815 3177.6368 3181.2834 3515.6832
redmass: 5.6775 5.5271 5.8171 6.0563 5.0458 6.1560 3.5435 3.3684 3.9421 1.3097 2.1585 2.6764 1.4723 2.9326 4.0585 3.0047 3.4476 2.7875 3.7049 6.0846 6.1711 6.3236 6.3597 3.0440 4.4846 4.7242 2.3210 3.1770 2.8505 2.0499 4.0500 6.2660 3.7582 4.2133 3.7991 3.4873 2.3913 1.9044 2.9724 1.6613 1.7683 2.6219 1.8915 1.6200 1.4470 2.0403 2.3733 2.0326 1.6987 1.7553 1.8832 2.0563 1.5943 1.4652 1.7437 2.0261 1.2301 1.2424 1.5962 1.6277 1.4403 1.1938 1.3213 1.3226 1.4701 1.4428 1.6583 1.6625 1.2130 1.2696 1.3663 1.0544 1.0857 1.0603 1.0803 1.0734 1.0894 7.8685 8.7231 1.0821 1.0651 1.0354 1.0640 1.0629 1.0249 1.0564 1.0980 1.0858 1.1017 1.1014 1.1001 1.1051 1.1103 1.1070 1.1076 1.0642
irintensity: 6.4169 0.6984 1.4594 2.0440 3.8925 4.5533 9.8157 3.0182 4.9042 0.4292 1.0865 0.4128 1.0309 1.6549 7.4521 6.5609 1.0650 2.6721 6.5919 11.2055 9.5982 68.0013 9.2779 1.1356 13.4744 34.5576 10.4876 39.5740 78.9271 52.8961 26.4766 6.8328 6.3587 23.1005 25.5636 24.0721 3.7253 2.6312 42.8790 1.1946 20.4727 4.8006 7.5145 26.9499 30.9273 8.4784 252.3420 68.0381 26.4048 15.7546 12.8756 16.9163 3.7004 4.2685 16.7038 7.5370 0.5623 9.1015 21.4696 6.2148 11.5092 1.2240 3.0164 3.3065 20.7056 8.6975 32.0057 104.9515 9.3101 76.2588 75.1424 12.1025 8.5509 27.6126 18.8186 14.2333 1.6550 251.4407 170.0889 12.2489 31.3817 15.6665 21.7279 19.8912 1.2864 6.9065 18.4469 3.8081 18.5189 8.4683 23.7412 30.1726 0.6296 0.8810 1.2280 30.2019
temp: 298.150 k
press: 1.00000 atm
elementType: 16 8 8 8 8 8 7 6 6 6 6 6 6 6 6 6 6 1 1 1 1 1 1 1 1 1 1 1 1 1 1 1 1 1
symmnumber: 1
zpe: 702640.0 jmol-1
zpe.correction: 0.267621 hartree
zpe.thermalcorrener: 0.287285 hartree
zpe.thermalcorrenthalpy: 0.288229 hartree
zpe.thermalcorrgfe: 0.217142 hartree
zpe.sumelectzpe: -1218.712405 hartree
zpe.sumelectthermal: -1218.692742 hartree
zpe.sumelectthermalent: -1218.691798 hartree
zpe.sumelectthermalfe: -1218.762884 hartree
dipole: 3.1854 0.9143 -3.6418
dipole: 4.9240
quadrupole: -99.7827 -111.3060 -112.4598
quadrupole: 13.8436 16.5272 0.2918
quadrupole: 8.0668 -3.4565 -4.6103 13.8436 16.5272 0.2918
hfenergy: -1218.9800263 hartree
pointgroup: C01 [X(C10H17N1O5S1)]
dipole: 1.2452487 -0.191694 1.4715649 debye
polarizability: 186.7719113|-4.158385|141.5405267|2.0690019|-0.3389721|132.6841667 unknown
InChI: InChI=1S/C10H17NO5S/c1-7(6-17(2,15)16)9(12)11-5-3-4-8(11)10(13)14/h7-8,13H,3-6H2,1-2H3
charge 0 multiplicity 1
34 atoms
S  -3.943035 -0.115842 0.022861
O  0.340046 1.717503 0.631156
O  4.256646 1.631806 0.40493
O  3.075213 0.909481 -1.463261
O  -4.589441 0.276072 -1.430168
O  -3.625244 -1.680907 0.402833
N  1.203627 -0.400727 0.281788
C  2.523801 0.011395 0.796979
C  3.255494 -1.343837 1.023562
C  1.17243 -1.827524 -0.147677
C  2.65828 -2.257933 -0.076854
C  -1.153365 0.04991 -0.38582
C  0.179189 0.520263 0.218622
C  -2.277698 0.865545 0.26769
C  3.261943 0.881225 -0.229971
C  -1.139707 0.232808 -1.929845
C  -5.110337 0.576257 1.375811
H  2.419487 0.605483 1.719195
H  2.997699 -1.722052 2.029043
H  4.351111 -1.243917 0.964516
H  0.760835 -1.929473 -1.165837
H  0.544597 -2.423888 0.543115
H  3.152646 -2.061807 -1.044261
H  2.765651 -3.330018 0.155849
H  -1.323527 -1.018928 -0.142726
H  -2.167197 0.956704 1.35994
H  -2.461345 1.843003 -0.201626
H  -0.927328 1.286332 -2.184193
H  -0.362233 -0.391233 -2.402912
H  -2.120639 -0.041161 -2.35637
H  -6.062453 0.052598 1.213112
H  -4.664237 0.330222 2.349141
H  -5.203394 1.65771 1.20357
H  4.736784 2.185331 -0.268889
