program: Gaussian 09
title: 000181960
version: EM64L-G09RevD.01
frameworkgroup: C1[X(C18H13N)]
method: RPBEPBE
basis: SDD
operation: Freq
keyword: #pfreq=noraman
keyword: PBEPBE/SDD
title: #p freq=noraman PBEPBE/SDD
converged: YES YES NO NO
title: Mulliken charges:
elementType: N C C C C C C C C C C C C C C C C C C H H H H H H H H H H H H H
charge: -0.696833 0.235707 0.233283 0.069022 0.155631 0.467490 0.425987 -0.432743 -0.444178 -0.514675 0.297025 -0.517166 -0.351342 -0.492503 -0.440994 -0.444144 -0.232252 -0.260954 -0.251121 0.222987 0.279326 0.235537 0.233565 0.221456 0.241529 0.240092 0.210172 0.223805 0.226334 0.228530 0.329242 0.302181
chargesum: 0.00000
title: Mulliken charges with hydrogens summed into heavy atoms:
elementType: N C C C C C C C C C C C C C C C C C C
charge: -0.065409 0.235707 0.233283 0.069022 0.155631 0.467490 0.425987 -0.209756 -0.164851 -0.279138 0.297025 -0.283601 -0.129886 -0.250974 -0.200902 -0.233972 -0.008447 -0.034619 -0.022591
polarizability: 3.79930302e+02 -2.80938335e+00 2.19119121e+02 -4.74040415e+00 -2.20420129e+00 8.09736738e+01
1716.lowfreq: -7.4183 -4.2082 -0.0005 -0.0004 0.0003 4.3361 54.5801 72.9316 118.7153
frequency: 54.5748 72.9174 118.7116 169.9274 181.8726 215.0429 244.8410 267.6706 311.8202 328.8166 394.1331 412.5810 425.9232 461.5501 474.1272 483.1519 495.5499 509.3663 522.3203 531.0110 557.7304 560.8739 566.8746 611.6094 633.7719 674.9765 692.5896 746.6523 753.8616 762.3305 768.0191 801.9887 819.1674 840.2832 845.3577 856.0983 866.8913 873.5905 891.4510 956.0323 960.0378 977.1959 988.0839 994.5726 1008.8357 1011.3093 1036.7516 1060.0810 1115.8512 1120.4861 1160.3166 1175.5427 1184.2764 1185.1663 1232.0493 1237.8884 1249.5510 1269.0771 1295.9885 1315.6373 1348.1436 1390.9672 1395.8204 1406.6702 1423.0388 1428.9845 1440.6261 1450.4948 1489.0630 1526.2343 1534.8572 1578.9577 1598.8864 1606.3570 1620.4515 1625.7631 1644.4239 3114.1064 3120.1398 3122.7542 3126.0417 3132.7613 3133.3110 3150.8382 3157.2155 3162.5114 3165.5846 3169.8977 3530.7701 3668.0802
redmass: 4.9190 4.2939 4.1321 4.1152 4.8156 4.1426 3.7181 5.4050 4.2429 4.5501 1.9226 3.3060 1.6508 3.0203 3.9754 2.7539 2.1494 3.4589 4.2343 3.9227 3.4505 4.2242 4.7613 6.0455 3.6460 5.8172 3.2944 1.7624 2.6381 1.6824 1.7691 5.4067 2.5517 1.7681 2.0504 3.1441 4.3411 1.5664 1.9200 1.3907 1.3399 1.4010 1.3421 2.1525 2.3203 2.0072 2.1902 2.6786 1.5210 1.9545 1.3223 1.1016 1.3149 1.2218 2.0046 1.8149 1.7832 1.7368 2.1964 2.2690 3.4672 3.7469 5.9525 4.1078 2.4331 3.6621 2.6760 2.3177 3.0846 3.6412 5.3625 6.9792 6.2922 6.0411 5.2666 6.3289 1.2076 1.0875 1.0874 1.0881 1.0882 1.0890 1.0889 1.0946 1.0997 1.0984 1.0939 1.0947 1.0454 1.1023
irintensity: 0.5548 0.0354 0.5629 1.5234 0.6021 2.3128 13.7575 2.2895 4.4347 0.6311 25.5556 7.7096 26.8822 12.3818 20.1729 41.5424 130.7277 11.2925 19.1509 8.0574 7.1807 1.6572 1.5463 0.2111 18.2461 3.4808 6.8790 3.1174 20.2520 92.9358 12.5725 7.3439 6.7969 26.0031 41.4910 6.3062 5.3595 17.4135 22.1504 3.4064 3.3306 0.9937 0.2687 3.8436 0.2463 5.3586 9.3520 4.3796 16.9614 0.6345 5.1408 2.5224 3.0391 1.8162 2.2560 14.8127 7.4655 8.1947 0.3339 27.6076 4.1035 3.1468 25.2794 2.3000 10.5703 8.3395 26.5058 19.1177 9.8482 11.9113 29.3582 37.4173 23.0839 4.9068 7.5617 8.1974 151.0976 16.7243 0.4534 12.2729 2.8030 1.9144 27.1307 25.2524 37.8767 25.9961 12.8286 39.5854 27.8205 22.6554
temp: 298.150 k
press: 1.00000 atm
elementType: 7 6 6 6 6 6 6 6 6 6 6 6 6 6 6 6 6 6 6 1 1 1 1 1 1 1 1 1 1 1 1 1
symmnumber: 1
zpe: 667507.3 jmol-1
zpe.correction: 0.254240 hartree
zpe.thermalcorrener: 0.267951 hartree
zpe.thermalcorrenthalpy: 0.268895 hartree
zpe.thermalcorrgfe: 0.214462 hartree
zpe.sumelectzpe: -747.237187 hartree
zpe.sumelectthermal: -747.223476 hartree
zpe.sumelectthermalent: -747.222532 hartree
zpe.sumelectthermalfe: -747.276966 hartree
dipole: 0.3329 1.5013 1.0035
dipole: 1.8362
quadrupole: -94.0632 -90.7481 -117.9341
quadrupole: 4.9355 2.0323 2.3259
quadrupole: 6.8519 10.1670 -17.0190 4.9355 2.0323 2.3259
hfenergy: -747.4914271 hartree
pointgroup: C01 [X(C18H13N1)]
dipole: 0.1262597 -0.5884684 -0.3995577 debye
polarizability: 379.9329795|1.0887003|219.1069685|5.8184226|-1.0303801|80.9831497 unknown
InChI: InChI=1S/C18H13N/c19-17-7-3-5-13-9-10-15-14-6-2-1-4-12(14)8-11-16(15)18(13)17/h1-11H,19H2
charge 0 multiplicity 1
32 atoms
N  2.496103 -2.52124 -0.525131
C  0.342232 -0.43774 0.080601
C  -0.591312 0.654715 -0.01055
C  1.783969 -0.177049 0.014729
C  -2.030323 0.39666 -0.038474
C  2.242242 1.192684 0.116518
C  -2.514222 -0.952362 0.136547
C  -0.081816 2.002874 -0.013889
C  -0.197266 -1.757659 0.336862
C  1.271831 2.256712 0.102343
C  2.802747 -1.195211 -0.178935
C  -1.561048 -2.001986 0.3709
C  -3.003727 1.429369 -0.237128
C  3.631242 1.508836 0.210246
C  -3.919193 -1.220389 0.112111
C  4.171584 -0.850782 -0.053447
C  4.58335 0.484897 0.166174
C  -4.374767 1.145751 -0.264048
C  -4.842649 -0.189913 -0.085507
H  -0.776356 2.846087 -0.053855
H  0.486468 -2.566937 0.60418
H  1.636993 3.288562 0.164723
H  -1.931941 -3.009156 0.596169
H  -2.683456 2.464241 -0.388451
H  3.933704 2.556902 0.30785
H  -4.260537 -2.253224 0.251364
H  4.926736 -1.638272 -0.171615
H  5.651276 0.711879 0.25563
H  -5.094053 1.956143 -0.426559
H  -5.917186 -0.401518 -0.105051
H  1.60222 -2.742256 -0.956991
H  3.273455 -3.141516 -0.744719
