program: Gaussian 09
title: 000181958
version: EM64L-G09RevD.01
frameworkgroup: C1[X(C17H21O3PS)]
method: RPBEPBE
basis: SDD
operation: Freq
keyword: #p
keyword: freq=noraman
keyword: PBEPBE/SDD
title: #p freq=noraman PBEPBE/SDD
converged: YES YES NO NO
title: Mulliken charges:
elementType: S P O O O C C C C C C C C C C C C C C C C C H H H H H H H H H H H H H H H H H H H H H
charge: -0.203882 0.826186 -0.484960 -0.523436 -0.496328 0.040177 -0.362320 -0.360430 -0.687644 -0.694251 0.363676 0.368332 -0.337300 -0.324045 -0.337347 -0.358107 -0.195070 -0.196062 -0.191774 -0.191429 -0.241210 -0.241357 0.230318 0.188940 0.210735 0.240778 0.195136 0.231246 0.237209 0.212616 0.218959 0.206868 0.210734 0.262692 0.284548 0.261318 0.249623 0.232645 0.230026 0.231711 0.230685 0.231366 0.230426
chargesum: 0.00000
title: Mulliken charges with hydrogens summed into heavy atoms:
elementType: S P O O O C C C C C C C C C C C C C C C C C
charge: -0.203882 0.826186 -0.484960 -0.523436 -0.496328 0.270495 0.037355 0.075483 -0.006573 -0.057689 0.363676 0.368332 -0.074608 -0.039497 -0.076029 -0.108484 0.037576 0.033965 0.039937 0.039256 -0.009844 -0.010931
polarizability: 2.97752698e+02 -1.39139579e+01 2.41130419e+02 1.46458337e+01 2.95372423e+00 1.72135897e+02
1716.lowfreq: -8.6842 -0.0017 -0.0015 0.0020 3.7689 11.2431 15.3169 19.4087 19.8233
frequency: 14.3296 17.7861 19.1608 31.5858 38.0104 40.8315 59.1836 76.4845 82.7592 92.5130 116.4079 144.2754 155.5156 170.5850 179.4287 199.4663 201.8990 225.3578 236.5711 287.4934 316.7254 332.3078 360.3659 392.2764 397.6667 410.9350 411.8242 419.6335 457.6598 468.3007 492.5402 522.3874 546.7087 558.0590 609.3164 610.0641 654.5973 670.7244 686.7172 689.3982 690.8713 745.7330 768.2469 770.0151 816.3492 823.9877 834.7850 838.6246 841.4565 861.5027 873.5387 917.6061 922.0612 937.0011 971.4867 974.4364 986.9448 988.1846 988.5098 992.5472 992.8173 1018.8621 1020.4269 1031.5723 1070.5814 1072.4497 1073.5829 1114.4658 1135.5432 1148.2397 1153.3089 1168.7524 1170.2960 1171.0667 1178.4647 1184.4161 1234.0973 1274.2178 1289.8930 1302.8995 1307.2631 1327.5764 1337.5732 1365.6139 1381.7816 1381.9455 1391.4983 1393.6359 1438.2978 1439.5632 1446.2996 1464.6660 1466.9918 1469.1809 1470.3336 1476.0719 1479.1674 1486.7775 1594.6913 1596.5066 1597.8234 1600.2425 2971.7668 2975.0263 2981.0644 2986.5967 2988.3131 3027.2886 3046.9430 3072.2550 3073.6790 3084.2416 3098.3861 3132.0857 3132.3804 3143.0958 3143.4149 3159.0491 3159.6295 3170.9489 3171.9753 3177.6505 3177.8412
redmass: 4.5044 3.5812 3.8598 4.6585 4.6638 4.8274 9.5210 3.3665 2.6418 2.7209 5.2980 3.2342 4.4818 3.1705 3.9255 2.4103 2.0210 1.7363 1.6350 5.3110 5.7856 5.2556 4.0835 7.0477 5.3963 3.0007 2.9405 5.2059 3.1147 4.8629 3.5779 4.0955 4.6380 6.5231 6.5949 6.5474 8.5877 6.2219 4.3017 2.2777 2.2353 1.2476 1.5665 1.6230 7.4010 7.9730 2.2053 1.9111 1.2444 1.2808 1.8566 1.4227 1.4144 2.0126 1.3752 1.3656 1.7242 3.5110 5.9808 1.3198 1.3131 2.1448 2.1392 1.9815 1.5444 2.2048 1.5720 1.7637 2.2723 2.4913 2.0226 2.1275 1.0683 1.0572 1.3544 1.5077 1.3387 1.2848 1.0983 1.3319 1.3235 1.1683 1.3951 1.7063 9.6273 9.5497 1.2253 1.2186 2.2077 2.2323 1.0812 1.0647 2.0942 1.8490 1.1893 1.0508 1.0425 1.0828 6.2578 6.2785 6.6480 6.5301 1.0382 1.0579 1.0667 1.0819 1.0379 1.0951 1.1007 1.1012 1.0989 1.0990 1.1005 1.0851 1.0852 1.0899 1.0897 1.0941 1.0943 1.0961 1.0957 1.1002 1.0999
irintensity: 0.3058 0.0571 0.1442 0.2187 0.6674 1.6949 0.7451 0.2771 0.9160 0.4589 0.7913 0.0765 1.2653 1.9581 5.5502 2.1179 1.2767 0.5317 0.5591 6.8454 9.3902 5.0900 5.1373 5.6026 19.3486 0.9463 0.0097 5.9693 6.7536 32.4421 14.6133 41.3597 2.1990 9.8597 3.3629 0.1279 71.9561 74.6432 55.0059 44.6481 19.6617 11.9285 78.8872 108.4652 201.1787 243.9255 92.4331 92.9351 1.2475 2.3119 18.0145 10.2595 9.3640 25.3551 1.1344 0.6524 17.1650 3.3168 1.1138 0.3680 0.6851 24.1666 18.8292 18.6435 6.6928 27.4661 3.9141 34.7941 4.5353 188.6596 34.2822 6.3334 2.6315 0.0436 65.1569 26.2948 1.6424 0.8921 0.3894 0.2150 0.4062 21.2515 1.9380 8.7142 0.8793 0.2532 23.1941 11.0257 4.7826 5.2109 4.4084 7.1308 150.2185 48.3309 7.2014 4.2326 9.0816 12.4669 34.7017 24.3061 6.8576 20.2558 32.5830 22.5289 23.2651 20.1631 22.1841 8.4691 3.0726 71.2705 43.6239 43.8671 20.8748 0.2506 0.4087 15.6137 12.4268 33.6109 26.4065 8.5847 6.8271 6.1464 6.9727
temp: 298.150 k
press: 1.00000 atm
elementType: 16 15 8 8 8 6 6 6 6 6 6 6 6 6 6 6 6 6 6 6 6 6 1 1 1 1 1 1 1 1 1 1 1 1 1 1 1 1 1 1 1 1 1
symmnumber: 1
zpe: 894416.9 jmol-1
zpe.correction: 0.340665 hartree
zpe.thermalcorrener: 0.364296 hartree
zpe.thermalcorrenthalpy: 0.365240 hartree
zpe.thermalcorrgfe: 0.282755 hartree
zpe.sumelectzpe: -1623.732489 hartree
zpe.sumelectthermal: -1623.708859 hartree
zpe.sumelectthermalent: -1623.707914 hartree
zpe.sumelectthermalfe: -1623.790400 hartree
dipole: -1.1939 -0.2597 -0.1517
dipole: 1.2312
quadrupole: -125.2071 -128.0133 -153.9926
quadrupole: -0.0083 2.2070 -0.1422
quadrupole: 10.5306 7.7244 -18.2550 -0.0083 2.2070 -0.1422
hfenergy: -1624.0731544 hartree
pointgroup: C01 [X(C17H21O3P1S1)]
dipole: 0.4658914 -0.1197057 0.0569249 debye
polarizability: 298.7051931|11.6252801|240.3200824|14.5555661|-2.2975786|171.9937389 unknown
InChI: InChI=1S/C17H21O3PS/c1-3-10-15(2)18-21(22,19-16-11-6-4-7-12-16)20-17-13-8-5-9-14-17/h4-9,11-15H,3,10H2,1-2H3
charge 0 multiplicity 1
43 atoms
S  -0.459766 -0.429175 -2.369984
P  -0.315007 -0.54086 -0.320367
O  0.901929 -1.541184 0.355941
O  -0.026463 0.932724 0.583866
O  -1.703819 -1.093571 0.576895
C  1.349828 -2.787589 -0.377732
C  2.734868 -3.100179 0.206572
C  3.809545 -2.043071 -0.12873
C  0.312839 -3.896596 -0.169672
C  5.176923 -2.374426 0.50542
C  1.076301 1.790141 0.282536
C  -2.992727 -0.49286 0.433516
C  2.259478 1.653982 1.040034
C  -3.212687 0.849719 0.813058
C  0.927659 2.802026 -0.689807
C  -4.044711 -1.320802 -0.010644
C  3.31783 2.563566 0.819028
C  -4.52468 1.367802 0.739271
C  1.9974 3.700813 -0.903545
C  -5.353053 -0.789983 -0.069156
C  3.190477 3.585078 -0.152319
C  -5.595854 0.553335 0.30166
H  1.430935 -2.521812 -1.452199
H  3.04752 -4.089673 -0.186095
H  2.636416 -3.208857 1.304779
H  3.460707 -1.053118 0.218991
H  3.918512 -1.967827 -1.229729
H  0.185062 -4.110736 0.90547
H  -0.669151 -3.610321 -0.585699
H  0.644299 -4.820247 -0.678888
H  5.932362 -1.6082 0.252919
H  5.557111 -3.351841 0.151695
H  5.101694 -2.424422 1.608253
H  2.330933 0.855824 1.785326
H  -2.371626 1.459665 1.156299
H  -0.002016 2.876111 -1.262009
H  -3.832352 -2.355511 -0.295688
H  4.238822 2.473798 1.405358
H  -4.709281 2.407631 1.03062
H  1.896583 4.490639 -1.655792
H  -6.178454 -1.424831 -0.409209
H  4.0145 4.286663 -0.321215
H  -6.610788 0.961872 0.250373
