program: Gaussian 09
title: 000181930
version: EM64L-G09RevD.01
frameworkgroup: C1[X(C8H5N3OS)]
method: RPBEPBE
basis: SDD
operation: Freq
keyword: #p
keyword: freq=noraman
keyword: PBEPBE/SDD
title: #p freq=noraman PBEPBE/SDD
converged: NO NO NO NO
title: Mulliken charges:
elementType: S O N N N C C C C C C C C H H H H H
charge: 0.321948 -0.183083 -0.263133 0.050712 0.050426 0.352882 -0.188654 0.233153 -0.766133 -0.198018 -0.296862 -0.136781 -0.363950 0.309490 0.309579 0.284193 0.234789 0.249441
chargesum: 0.00000
title: Mulliken charges with hydrogens summed into heavy atoms:
elementType: S O N N N C C C C C C C C
charge: 0.321948 -0.183083 -0.263133 0.050712 0.050426 0.352882 -0.188654 0.233153 -0.147064 -0.198018 -0.012669 0.098008 -0.114509
polarizability: 1.94759140e+02 -1.04159232e-01 1.27185623e+02 -5.77362318e-04 4.06925363e-03 5.06518783e+01
1716.lowfreq: -0.0022 -0.0015 -0.0003 0.4603 10.0135 11.3192 101.8910 107.9061 120.2470
frequency: 101.8908 107.9033 120.2469 183.2385 253.4734 314.5844 362.1666 394.2700 434.0989 488.6766 535.0643 540.0982 580.5060 592.0058 619.7990 656.6099 685.7075 725.5936 788.4299 809.4607 823.2296 883.9811 887.5789 934.2490 976.6003 978.5780 1030.1272 1077.0857 1120.4246 1146.7309 1186.6661 1202.0460 1235.2623 1280.9829 1329.4315 1365.5694 1379.2576 1423.4536 1445.6686 1480.4815 1552.6820 1607.7994 1650.0788 3055.3762 3129.0239 3144.3694 3167.2073 3186.9567
redmass: 5.4452 3.4703 6.3941 8.0420 6.9880 6.1740 12.8260 9.9527 4.5001 13.3459 6.8483 3.1417 10.1934 3.7815 9.7192 8.1121 7.1487 5.7286 3.1963 1.6717 7.2744 9.3895 1.6894 1.3810 1.3598 8.4340 2.3559 3.4008 1.1512 1.5782 4.9801 5.8664 1.4408 2.0839 5.1806 2.5156 5.0230 1.1050 2.2905 9.1482 7.3949 8.0977 12.5110 1.0570 1.1069 1.0890 1.0929 1.0993
irintensity: 14.9307 0.1874 2.4178 4.0664 0.7017 0.6020 8.0765 1.8320 0.0051 3.0871 20.5946 0.0411 1.3082 1.3719 6.7440 0.6193 7.9669 5.6612 29.5942 44.7584 1.6518 11.6814 7.4482 0.4340 2.1291 11.5027 2.0824 21.3219 0.1358 48.5309 98.0768 29.7262 20.6191 32.1440 1.1660 31.9962 305.0597 3.4116 20.2126 391.6363 0.2559 57.2252 214.2248 3.3416 0.0133 10.2113 14.9331 5.6735
temp: 298.150 k
press: 1.00000 atm
elementType: 16 8 7 7 7 6 6 6 6 6 6 6 6 1 1 1 1 1
symmnumber: 1
zpe: 316859.2 jmol-1
zpe.correction: 0.120685 hartree
zpe.thermalcorrener: 0.130233 hartree
zpe.thermalcorrenthalpy: 0.131177 hartree
zpe.thermalcorrgfe: 0.085145 hartree
zpe.sumelectzpe: -944.490456 hartree
zpe.sumelectthermal: -944.480908 hartree
zpe.sumelectthermalent: -944.479964 hartree
zpe.sumelectthermalfe: -944.525996 hartree
dipole: 1.5740 3.3728 0.0002
dipole: 3.7220
quadrupole: -64.4487 -97.5413 -81.8536
quadrupole: -7.7448 0.0000 -0.0007
quadrupole: 16.8325 -16.2601 -0.5724 -7.7448 0.0000 -0.0007
hfenergy: -944.6111415 hartree
pointgroup: C01 [X(C8H5N3O1S1)]
dipole: -0.7648195 -1.2487459 -0.0000091 debye
dipolederiv: -0.5577697 0.066173 -0.0000222 0.0528588 0.0230073 0.0000007 -0.000274 0.0000693 0.0213264 -0.4762619 0.0847642 0.0000056 -0.4634543 -1.1009542 -0.000541 0.0003704 0.0006678 -0.3216607 -1.2866599 -0.3844246 -0.0001928 -0.5228136 -1.0542059 -0.0001094 -0.0002558 -0.0002448 0.010136 -1.4198621 -0.0879617 -0.0002501 -0.0589703 -0.2976123 -0.000012 0.0000423 0.000022 -0.2175838 -0.5743543 0.0280528 -0.000101 0.0048747 -0.2456973 0.0000089 -0.0000512 -0.0000133 -0.2158725 0.5095791 -0.052099 0.0001869 0.379121 -0.3160965 0.0000926 0.0001072 0.0000395 0.1217199 1.4719957 -0.0468954 0.0000922 0.4365251 0.7824919 0.0002279 0.0000385 0.0000153 -0.0168228 1.3056421 0.2352462 0.0000877 0.7830852 1.3983681 0.000557 -0.0005797 -0.0003501 0.217696 -0.3125455 0.3367688 0.0000524 0.2369166 0.1373439 -0.0000135 0.0006403 -0.0001803 0.0864284 0.8704273 -0.0735296 0.0002046 -0.749295 0.2693726 -0.0002143 0.0000823 -0.0000197 0.0711738 0.1694542 -0.0471934 0.0000834 -0.0556598 0.1407174 -0.0000191 0.0001046 -0.0000325 -0.1194785 -0.2528468 -0.0140394 -0.0000207 -0.217047 -0.0235353 -0.0000823 -0.0000045 -0.0000005 -0.1265399 0.3912672 -0.0391085 0.0001478 0.2216845 0.1130591 0.0000313 0.0001157 -0.0000172 -0.0864159 0.0960866 -0.0141816 -0.0429143 -0.053132 0.0305096 -0.0324114 -0.0623523 -0.0264784 0.0479555 0.0962089 -0.0140937 0.0427956 -0.0530304 0.0303363 0.0324354 0.0621978 0.026497 0.0479374 0.0875271 -0.0630926 -0.0000209 -0.0257244 0.0247237 0.0000032 -0.0000311 -0.0000157 0.1721277 0.0031789 0.0865577 -0.0000571 0.1036535 -0.0028505 0.0000504 -0.0000577 0.0000454 0.1675443 -0.1210667 -0.0009431 -0.0000771 -0.0195926 0.0910222 -0.0000041 -0.0000929 -0.0000036 0.1403287 unknown
polarizability: 193.8782819|-7.6653199|128.0664735|0.031014|-0.0105851|50.6518858 unknown
InChI: InChI=1S/C8H5N3OS/c12-6-4-13-8-10-7-5(11(6)8)2-1-3-9-7/h1-3H,4H2
charge 0 multiplicity 1
18 atoms
S  -2.782548 1.635936 -0.000875
O  -1.908524 -2.316992 -0.000508
N  -0.823945 -0.21883 -0.000886
N  0.067016 1.915069 -0.000702
N  2.442097 1.206083 0.000124
C  0.573776 -0.398869 -0.000272
C  -1.037631 1.194196 -0.000665
C  -1.944411 -1.065144 -0.001424
C  -3.23025 -0.218286 -0.000669
C  1.117231 0.938261 -0.000267
C  1.410743 -1.523089 0.000127
C  2.799217 -1.238077 0.000524
C  3.257882 0.106986 0.000517
H  -3.823486 -0.44598 -0.89981
H  -3.8226 -0.446031 0.899048
H  1.02022 -2.543769 0.000088
H  3.530533 -2.051602 0.000823
H  4.332181 0.319636 0.000824
