program: Gaussian 09
title: 000181956
version: EM64L-G09RevD.01
frameworkgroup: C1[X(C18H15N3O2)]
method: RPBEPBE
basis: SDD
operation: Freq
keyword: #p
keyword: freq=noraman
keyword: PBEPBE/SDD
title: #p freq=noraman PBEPBE/SDD
converged: YES YES NO NO
title: Mulliken charges:
elementType: O O N N N C C C C C C C C C C C C C C C C C C H H H H H H H H H H H H H H H
charge: -0.419899 -0.240824 -0.295005 -0.409274 0.020746 0.290293 0.081918 -0.539694 0.078185 0.176800 0.241697 -0.577563 -0.072257 -0.329625 0.500816 -0.351329 -0.221893 -0.212384 -0.430417 -0.388315 -0.226262 -0.231572 -0.243274 0.278245 0.173379 0.267245 0.208223 0.342480 0.284688 0.242435 0.231655 0.232585 0.226558 0.255042 0.382786 0.222024 0.224994 0.226794
chargesum: 0.00000
title: Mulliken charges with hydrogens summed into heavy atoms:
elementType: O O N N N C C C C C C C C C C C C C C C C C C
charge: -0.037114 -0.240824 -0.295005 -0.066794 0.020746 0.290293 0.081918 -0.088070 0.078185 0.176800 0.241697 -0.102095 -0.072257 -0.044937 0.500816 -0.108894 0.009762 0.020201 -0.203859 -0.133273 -0.004239 -0.006578 -0.016480
polarizability: 3.68757125e+02 3.46470833e+01 2.29333634e+02 -2.14647261e+01 -7.09834035e-01 1.01629071e+02
1716.lowfreq: -7.5248 -0.0010 -0.0009 0.0003 1.3927 5.8471 14.3285 25.8313 30.6105
frequency: 13.2729 25.8170 30.5868 61.8074 75.8290 85.4279 122.3147 141.7204 179.8489 199.5886 239.6450 267.4252 301.1335 332.1307 335.4835 347.7467 366.7934 380.3825 404.7951 412.3456 436.3533 438.9819 497.1236 505.6608 537.9959 561.1075 568.4488 586.4910 590.3717 616.8979 621.0627 637.8576 676.2729 697.3179 707.7319 726.4319 746.4761 749.8129 756.2158 761.4279 762.7875 807.9048 835.2369 856.5871 859.7617 880.6319 920.4648 937.8213 961.5628 978.3082 979.1991 989.0078 989.4612 994.2391 1004.0035 1020.5062 1026.0320 1041.1804 1084.6979 1093.7501 1125.9769 1152.4546 1171.2129 1173.5518 1185.7911 1187.5284 1207.0858 1217.4502 1244.6435 1248.2847 1263.9501 1289.7707 1311.6341 1317.5772 1326.4194 1331.2458 1350.5904 1382.0053 1422.0989 1436.1614 1440.5352 1462.7153 1472.9492 1480.3344 1483.5266 1493.8205 1544.9132 1590.2344 1592.5803 1611.8831 1613.6104 1631.4096 1672.0459 2940.0235 2995.7232 3042.1734 3066.1470 3108.4910 3118.5537 3130.6353 3141.6206 3142.4824 3155.7743 3161.0674 3171.4003 3204.3319 3569.1618 3622.9895
redmass: 5.1498 4.0323 5.3167 4.0957 6.1370 4.9457 5.5347 6.3876 4.6163 7.8532 4.8388 4.4586 2.4445 5.4767 4.7302 3.7509 4.4357 4.9659 2.8344 1.4668 3.5759 3.6562 5.5191 3.8102 8.5908 1.1250 3.9703 5.4709 7.3235 6.4631 10.3509 4.9710 5.2081 9.1510 1.7547 3.4428 4.7758 3.2508 1.4088 1.8094 2.4511 3.9890 3.4807 1.2546 1.3924 4.3867 1.5099 1.3709 2.3456 1.3872 1.3043 4.4738 6.1507 1.5131 3.5126 2.0926 2.1882 2.5424 1.7532 2.6533 2.2873 1.6423 1.0574 1.1080 1.4016 1.3140 2.0339 2.5034 1.9422 2.5329 1.3586 1.2347 2.2473 3.4305 1.5608 1.3013 2.3834 7.7057 3.1163 3.7798 2.1717 1.2611 2.9081 1.2191 1.9407 4.7279 8.0345 8.2608 6.2913 7.7548 6.1425 7.5907 9.4194 1.0689 1.0617 1.0894 1.1026 1.0875 1.0865 1.0909 1.0862 1.0958 1.0920 1.1014 1.0985 1.0956 1.0652 1.0812
irintensity: 0.8082 0.3117 0.1490 0.6251 1.0882 0.6005 3.0256 0.9068 0.3574 1.0427 1.7076 3.7140 1.4482 0.3944 6.7304 6.2048 8.3306 15.9250 0.1175 58.1483 26.9054 26.4367 3.8225 17.0663 3.3247 138.2748 3.6479 2.1924 1.7659 0.2033 0.5169 10.6990 0.9623 0.4401 53.4883 6.0396 8.1508 3.2451 154.6685 4.7351 7.2493 3.6526 4.7755 0.0961 0.0104 4.4452 1.8641 5.5157 15.6606 0.1399 0.1334 37.5017 0.0998 6.3996 7.8065 34.1743 7.6099 13.0087 20.0376 13.0904 20.8620 22.3724 0.5641 1.2695 66.6438 60.1587 16.6661 2.6865 4.0073 68.1832 2.4645 10.5054 47.7088 71.3566 3.0905 0.0703 32.7917 0.6210 5.9111 103.8856 9.0550 60.2271 9.6215 23.0130 31.4134 79.8443 556.7802 120.4398 12.5431 1.8081 17.8200 10.2617 768.5537 40.5969 22.3334 3.2757 9.2939 12.7116 3.4012 11.9800 1.0086 39.2818 13.7477 30.8032 20.4552 1.1774 48.3122 105.5022
temp: 298.150 k
press: 1.00000 atm
elementType: 8 8 7 7 7 6 6 6 6 6 6 6 6 6 6 6 6 6 6 6 6 6 6 1 1 1 1 1 1 1 1 1 1 1 1 1 1 1
symmnumber: 1
zpe: 770238.6 jmol-1
zpe.correction: 0.293368 hartree
zpe.thermalcorrener: 0.311931 hartree
zpe.thermalcorrenthalpy: 0.312875 hartree
zpe.thermalcorrgfe: 0.244200 hartree
zpe.sumelectzpe: -1008.042086 hartree
zpe.sumelectthermal: -1008.023524 hartree
zpe.sumelectthermalent: -1008.022579 hartree
zpe.sumelectthermalfe: -1008.091255 hartree
dipole: -4.3950 -5.0946 -0.2702
dipole: 6.7338
quadrupole: -102.7852 -138.1108 -137.8587
quadrupole: -10.2169 -6.0787 1.3109
quadrupole: 23.4664 -11.8592 -11.6072 -10.2169 -6.0787 1.3109
hfenergy: -1008.3354548 hartree
pointgroup: C01 [X(C18H15N3O2)]
dipole: 1.7185766 -2.0075899 0.1864498 debye
polarizability: 368.0521893|-36.4496957|229.556352|-21.6739872|-4.7742312|102.1112899 unknown
InChI: InChI=1S/C18H15N3O2/c22-16-13(11-10-12-6-2-1-3-7-12)17(23)21-15-9-5-4-8-14(15)19-18(21)20-16/h1-9,19,23H,10-11H2
charge 0 multiplicity 1
38 atoms
O  0.692002 -1.743697 0.624869
O  -0.988622 2.792263 -0.018639
N  2.064844 0.048891 0.086907
N  3.607502 1.597063 -0.432345
N  1.311706 2.357254 -0.248583
C  3.315766 -0.623341 0.038562
C  -0.283238 0.519286 0.331465
C  -1.717946 0.113987 0.589611
C  2.242541 1.431718 -0.204525
C  0.763858 -0.379701 0.354697
C  4.287388 0.372865 -0.292909
C  -2.553108 0.001759 -0.728133
C  -0.032499 1.956903 0.015651
C  3.68171 -1.964862 0.244239
C  -4.01924 -0.280232 -0.441639
C  5.648054 0.047555 -0.425753
C  5.053222 -2.28951 0.109815
C  6.018034 -1.302988 -0.218766
C  -4.563116 -1.58192 -0.587745
C  -4.867432 0.760876 0.021028
C  -5.91872 -1.842003 -0.279221
C  -6.221628 0.505814 0.329734
C  -6.75247 -0.797979 0.182697
H  -2.181755 0.895502 1.218181
H  -1.804947 -0.836791 1.160192
H  -2.441565 0.963839 -1.259727
H  -2.122863 -0.790007 -1.370666
H  4.004767 2.504621 -0.663268
H  2.933191 -2.717343 0.49634
H  6.395228 0.805748 -0.679212
H  5.372863 -3.325187 0.263434
H  7.070517 -1.589151 -0.314533
H  -3.923893 -2.394825 -0.956577
H  -4.460534 1.774371 0.128052
H  -0.241119 -1.988383 0.849106
H  -6.323946 -2.852941 -0.403784
H  -6.864305 1.321815 0.679681
H  -7.804052 -0.995466 0.419766
