program: Gaussian 09
title: 000181923
version: EM64L-G09RevD.01
frameworkgroup: C1[X(C9H12N4O2)]
method: RPBEPBE
basis: SDD
operation: Freq
keyword: #p
keyword: freq=noraman
keyword: PBEPBE/SDD
title: #p freq=noraman PBEPBE/SDD
converged: YES YES NO NO
title: Mulliken charges:
elementType: O O N N N N C C C C C C C C C H H H H H H H H H H H H
charge: -0.244485 -0.329655 -0.454976 -0.052141 -0.436410 -0.636721 -0.399590 -0.417334 -0.508428 -0.494766 0.322117 0.030621 -0.055843 0.168493 0.299274 0.213516 0.211727 0.205870 0.212538 0.232500 0.240252 0.254125 0.231547 0.380608 0.345225 0.325368 0.356567
chargesum: 0.00000
title: Mulliken charges with hydrogens summed into heavy atoms:
elementType: O O N N N N C C C C C C C C C
charge: -0.244485 -0.329655 -0.074368 -0.052141 -0.091185 0.045214 0.025653 0.001074 -0.035675 -0.009093 0.322117 0.030621 -0.055843 0.168493 0.299274
polarizability: 1.84986569e+02 -1.05985729e+01 1.43970090e+02 4.43268405e-01 -7.42410156e-01 7.04345961e+01
1716.lowfreq: -14.4626 -9.0618 -5.0117 -0.0005 0.0001 0.0003 53.0323 80.0767 98.2950
frequency: 53.0138 80.0733 98.2815 102.0507 125.4266 190.4933 210.2864 264.7353 283.3488 309.8035 323.1321 333.5332 381.7983 435.1206 456.5944 507.4900 516.4336 533.4977 560.7941 597.5361 607.6943 641.0810 697.1852 702.2256 716.0945 753.3340 770.6656 824.0038 851.7418 867.4089 900.7381 911.2391 927.5380 970.6917 983.4344 1053.3751 1081.0868 1086.1761 1098.1899 1134.0608 1141.2977 1164.9092 1205.1929 1235.2781 1241.8345 1270.2407 1303.1490 1314.3419 1335.0641 1341.7325 1353.4712 1391.8634 1450.4774 1457.9395 1467.6580 1471.0508 1475.1850 1508.2780 1558.3630 1601.2202 1608.4574 1649.0329 1653.7753 2964.1452 2974.3728 2981.9978 2988.1223 3016.7799 3037.5483 3047.1312 3056.1919 3267.7786 3529.2058 3546.2842 3696.0595
redmass: 3.7330 7.4238 2.7759 4.0414 5.2744 3.6835 5.3744 5.6476 2.1189 9.2854 4.4275 2.3289 1.1872 4.2164 3.0209 4.7875 4.1963 1.1596 5.4688 4.4550 3.2132 1.5062 4.9266 4.8407 4.8832 4.9920 3.9672 1.6614 2.8000 1.1197 1.5293 2.9246 3.3347 4.2775 2.3134 1.9100 2.3920 2.7068 1.8421 1.1972 3.0289 1.5277 2.8188 1.4802 1.3920 1.3814 2.1521 1.8977 1.4251 1.4466 1.6538 3.8216 1.1493 1.0953 4.1887 1.1197 1.0996 3.6709 5.9389 1.4981 4.2955 6.3503 2.4562 1.0606 1.0676 1.0630 1.0641 1.0960 1.0924 1.0989 1.1040 1.0827 1.0751 1.0480 1.1047
irintensity: 4.8982 9.9156 4.1746 1.3436 13.2850 0.7075 1.1192 18.0616 0.5112 1.6188 3.0987 2.1289 18.9662 0.1774 3.3162 1.6504 3.6133 276.3245 7.0610 9.3259 5.2640 104.7362 4.2966 0.8980 50.2410 31.0773 2.0080 5.3803 11.1340 96.9844 6.3944 9.7511 2.9098 30.7889 8.1923 10.5494 0.4869 2.8967 7.7509 1.7253 25.7922 3.3210 8.9694 19.3892 5.6802 8.9225 17.9617 219.2268 1.6178 2.3218 1.0191 14.6277 27.7187 10.7890 569.6489 23.2163 8.9420 191.1616 726.3437 119.1504 408.9549 189.5788 149.0418 24.4848 13.6590 37.2539 26.3505 28.7380 14.6382 57.3318 59.5423 356.2385 38.5315 98.1452 49.1210
temp: 298.150 k
press: 1.00000 atm
elementType: 8 8 7 7 7 7 6 6 6 6 6 6 6 6 6 1 1 1 1 1 1 1 1 1 1 1 1
symmnumber: 1
zpe: 563721.3 jmol-1
zpe.correction: 0.214710 hartree
zpe.thermalcorrener: 0.227920 hartree
zpe.thermalcorrenthalpy: 0.228864 hartree
zpe.thermalcorrgfe: 0.174873 hartree
zpe.sumelectzpe: -718.557812 hartree
zpe.sumelectthermal: -718.544602 hartree
zpe.sumelectthermalent: -718.543658 hartree
zpe.sumelectthermalfe: -718.597649 hartree
dipole: 4.8079 -4.6643 0.1490
dipole: 6.7003
quadrupole: -52.9718 -106.9352 -88.7347
quadrupole: 17.2681 0.0454 0.4625
quadrupole: 29.9088 -24.0546 -5.8541 17.2681 0.0454 0.4625
hfenergy: -718.7725223 hartree
pointgroup: C01 [X(C9H12N4O2)]
dipole: -1.4122766 -1.9907724 0.9956216 debye
polarizability: 177.6872084|19.2404684|132.3455785|-3.8913946|-33.8444645|89.3584686 unknown
InChI: InChI=1S/C9H12N4O2/c10-8(15)13-9-11-6-4-2-1-3-5(6)7(14)12-9/h11,13H,1-4,10H2
charge 0 multiplicity 1
27 atoms
O  0.878848 2.637715 -1.665481
O  -2.366131 -2.292371 0.879752
N  -0.253091 -0.823208 0.185479
N  -0.842034 1.188959 -0.986899
N  -2.529385 -0.259773 -0.288809
N  -4.459015 -1.482562 0.265512
C  3.473353 -0.969423 0.933294
C  3.931565 -0.221375 -0.340235
C  2.053971 -1.553443 0.742027
C  3.001757 0.975164 -0.641601
C  1.119164 -0.539485 0.112874
C  1.534883 0.61743 -0.518028
C  0.537187 1.556765 -1.095852
C  -1.152571 0.059706 -0.37403
C  -3.080966 -1.395227 0.316967
H  3.470652 -0.265832 1.78883
H  4.176625 -1.785211 1.183712
H  3.924667 -0.924701 -1.197103
H  4.972717 0.132246 -0.221417
H  1.63992 -1.891801 1.712809
H  2.101666 -2.452006 0.092517
H  3.178566 1.380129 -1.655225
H  3.221673 1.817869 0.04551
H  -0.649119 -1.667171 0.642963
H  -3.110688 0.456339 -0.732347
H  -5.055795 -0.787212 -0.177334
H  -4.885517 -2.297923 0.699612
