program: Gaussian 09
title: 000181904
version: EM64L-G09RevD.01
frameworkgroup: C1[X(C12H5Cl5O)]
method: RPBEPBE
basis: SDD
operation: Freq
keyword: #p
keyword: freq=noraman
keyword: PBEPBE/SDD
title: #p freq=noraman PBEPBE/SDD
converged: YES YES NO NO
title: Mulliken charges:
elementType: Cl Cl Cl Cl Cl O C C C C C C C C C C C C H H H H H
charge: 0.025829 0.041495 0.003776 0.053690 -0.059648 -0.411710 0.566998 0.217826 -0.393218 -0.348518 0.252700 -0.343398 -0.043728 -0.093252 -0.107635 -0.295692 -0.237100 -0.244768 0.285233 0.264762 0.240408 0.260790 0.365161
chargesum: 0.00000
title: Mulliken charges with hydrogens summed into heavy atoms:
elementType: Cl Cl Cl Cl Cl O C C C C C C C C C C C C
charge: 0.025829 0.041495 0.003776 0.053690 -0.059648 -0.046549 0.566998 0.217826 -0.393218 -0.063285 0.252700 -0.078636 -0.043728 -0.093252 -0.107635 -0.295692 0.003308 0.016022
polarizability: 2.69907403e+02 -7.59996521e+00 1.92511793e+02 7.02241472e+00 -1.27974461e+01 1.00100429e+02
1716.lowfreq: -1.7747 -0.0024 0.0005 0.0022 4.8380 7.3610 28.4084 41.9545 56.8582
frequency: 28.3776 41.9421 56.8523 77.1503 85.8545 126.4326 166.5649 191.4639 204.8638 213.4439 224.5445 238.2187 247.9159 272.1791 291.4235 317.1489 337.5126 353.5510 372.5831 461.2475 475.6946 487.7780 509.0109 535.2658 540.9569 553.0594 596.2653 603.5060 633.6863 703.7353 729.0648 738.2134 771.5310 782.7225 807.4441 849.5614 882.0956 909.4974 968.5771 1012.8167 1068.2253 1082.3819 1134.2796 1171.6271 1180.4425 1228.9961 1267.3618 1278.7881 1325.5252 1347.4814 1385.7763 1402.7785 1429.3386 1476.3243 1525.4692 1573.0536 1576.6233 1608.9989 3152.0681 3167.5390 3182.5673 3189.9906 3488.0293
redmass: 12.7121 13.2993 9.3279 30.8543 15.6161 10.1635 14.3224 19.3051 19.9221 17.4087 6.4342 10.0175 8.2120 6.4855 6.5084 27.7017 26.7015 9.9288 9.8929 1.1345 5.2811 6.3243 8.1046 4.0103 5.2555 9.4797 6.8203 8.6542 9.4282 9.2537 4.8518 3.5411 2.3486 3.1105 6.4062 8.0959 1.5002 1.3618 1.3303 10.2477 2.1286 7.3920 2.0468 1.1374 1.9555 2.1538 2.9701 2.1823 4.1166 7.0607 5.1774 3.5559 3.0378 3.5002 9.6630 7.7044 7.5636 7.0112 1.0868 1.0928 1.0997 1.0927 1.0648
irintensity: 0.1205 0.1540 0.3001 0.0375 0.1050 0.2435 0.0888 0.2837 0.3781 0.1214 0.0099 0.1475 1.3458 5.2397 3.0917 0.2086 0.2755 2.5554 4.4438 105.2091 26.3474 9.6291 13.1006 0.9946 4.1069 15.2519 9.3679 28.8967 7.2095 47.3251 15.0272 12.8824 64.9970 6.9477 16.1531 34.9908 6.8270 0.8234 0.2657 14.3856 25.0765 32.0334 26.1652 34.6048 50.3344 67.4490 51.2289 36.1004 48.9683 33.5320 18.8861 112.1709 65.0798 9.2672 26.3662 6.2370 0.3154 8.2558 3.9421 3.0384 6.0397 0.5172 69.7640
temp: 298.150 k
press: 1.00000 atm
elementType: 17 17 17 17 17 8 6 6 6 6 6 6 6 6 6 6 6 6 1 1 1 1 1
symmnumber: 1
zpe: 350765.5 jmol-1
zpe.correction: 0.133600 hartree
zpe.thermalcorrener: 0.150384 hartree
zpe.thermalcorrenthalpy: 0.151328 hartree
zpe.thermalcorrgfe: 0.087030 hartree
zpe.sumelectzpe: -2834.528113 hartree
zpe.sumelectthermal: -2834.511329 hartree
zpe.sumelectthermalent: -2834.510385 hartree
zpe.sumelectthermalfe: -2834.574683 hartree
dipole: 3.3903 -0.1712 1.2413
dipole: 3.6144
quadrupole: -134.1763 -136.5786 -134.6601
quadrupole: -0.7405 2.5731 -5.6729
quadrupole: 0.9620 -1.4402 0.4782 -0.7405 2.5731 -5.6729
hfenergy: -2834.6617128 hartree
pointgroup: C01 [X(C12H5Cl5O1)]
dipole: 1.3514246 -0.2446939 -0.3686457 debye
dipolederiv: -0.1785686 -0.217304 0.050969 -0.2254773 -0.5265327 0.1361716 0.0833052 0.1326758 -0.0434567 -0.2797042 0.2963989 -0.068158 0.3403356 -0.4164357 0.0967369 -0.0772835 0.0986947 -0.0201435 -0.1929218 -0.2075425 0.0679434 -0.2950449 -0.5965265 0.176426 0.0920167 0.1835433 -0.0793176 -0.7669909 -0.0765388 0.0642413 -0.0632869 -0.0101776 0.0085571 0.0660317 0.0147554 0.0033586 -0.4695622 0.1015637 -0.2401469 0.1407141 -0.106872 0.1547079 -0.3576067 0.1510888 -0.4682595 -0.2426173 -0.0798527 0.3262238 -0.0612359 -0.3973397 0.2151976 0.120761 0.2097019 -1.0371597 0.4055192 -0.1036856 0.0236254 -0.0592928 -0.0542336 0.0537776 -0.0995884 0.0363579 -0.0154572 0.1876382 0.0096428 -0.1065317 -0.0404018 -0.0913896 0.0088796 0.2520206 0.0316863 -0.0898806 0.0524954 0.3990283 -0.094714 0.421648 0.6399108 -0.168317 -0.0945011 -0.1747399 -0.0190187 -0.2367557 -0.0892899 0.0361592 -0.0876683 -0.1917161 0.0515242 0.0626081 0.0143469 -0.0590036 -0.0386398 0.1129243 -0.3933694 0.0693021 0.1387489 -0.1994941 -0.2880632 -0.1784572 0.7518705 0.0475457 -0.0285714 0.0703379 0.0716525 -0.0704433 -0.0672184 -0.1309636 -0.027303 0.032623 0.1437184 -0.505319 0.1287155 -0.6395876 0.4845012 -0.1123179 0.1382318 -0.110343 0.0217479 0.1022924 0.3622556 -0.1161124 0.3943153 0.884659 -0.2822683 -0.0742334 -0.3016457 0.060482 0.9377051 0.1023458 -0.0849943 0.1570036 -0.2651236 0.0514955 -0.1056997 0.0562923 -0.0526626 0.4851027 -0.22793 0.6381785 -0.189766 -0.0103839 -0.215444 0.5288502 -0.216409 0.4599658 -0.1767446 0.020285 -0.0533992 0.0106835 -0.1509556 -0.0554501 -0.1231552 -0.0557725 -0.0163208 -0.1199946 0.043998 -0.1100067 -0.0186047 -0.075052 -0.0072049 0.0549525 -0.0097891 -0.0452624 0.0827476 0.0387007 -0.003938 0.0557689 0.0526116 0.0177258 -0.00167 0.0359253 0.1288453 0.048029 0.027155 -0.0837313 0.0280132 0.1143309 0.0486105 -0.0963716 0.0319048 0.0378741 0.0226868 -0.0069152 0.0463938 -0.024012 0.1420453 0.071915 0.062924 0.0665793 -0.0428996 -0.035913 0.0033918 0.0143449 0.0173451 0.1585487 0.0181161 0.0052868 0.0171217 0.1156422 0.2229324 0.0252594 -0.1120309 -0.0024037 0.3478255 -0.0021265 -0.0178522 -0.0062151 0.3764331 unknown
polarizability: 270.9963604|0.3144324|162.1475307|-2.3474309|-44.6790837|129.375733 unknown
InChI: InChI=1S/C12H5Cl5O/c13-7-3-1-2-5(12(7)18)6-4-8(14)10(16)11(17)9(6)15/h1-4,18H
charge 0 multiplicity 1
23 atoms
Cl -0.402387 2.677656 -0.924503
Cl -3.578251 2.404769 -0.6866
Cl -2.988735 -2.935121 0.831764
Cl -4.912265 -0.386673 0.198402
Cl 4.529414 -0.926658 1.835998
O  1.489682 -0.822019 1.854535
C  -0.282666 -0.04033 -0.232499
C  1.200004 -0.005963 -0.409152
C  -1.12538 1.074255 -0.488779
C  -0.8976 -1.248506 0.181147
C  2.060581 -0.423141 0.647032
C  1.784256 0.395743 -1.636683
C  -2.532493 0.975878 -0.358275
C  -2.290007 -1.350869 0.311846
C  -3.12748 -0.24646 0.038544
C  3.461805 -0.400634 0.437821
C  3.181864 0.401497 -1.824877
C  4.039618 0.001762 -0.774197
H  -0.271964 -2.114685 0.405405
H  1.127219 0.702652 -2.455591
H  3.607323 0.713325 -2.783016
H  5.126322 0.001281 -0.895848
H  2.202239 -1.033359 2.516126
