program: Gaussian 09
title: 000181887
version: EM64L-G09RevD.01
frameworkgroup: C1[X(C6H6O)]
method: RPBEPBE
basis: SDD
operation: Freq
keyword: #p
keyword: freq=noraman
keyword: PBEPBE/SDD
title: #p freq=noraman PBEPBE/SDD
converged: NO YES NO NO
title: Mulliken charges:
elementType: O C C C C C C H H H H H H
charge: -0.207156 0.376664 -0.385760 -0.298500 -0.160836 -0.207378 -0.554318 0.254874 0.271746 0.261139 0.220405 0.216812 0.212307
chargesum: 0.00000
title: Mulliken charges with hydrogens summed into heavy atoms:
elementType: O C C C C C C
charge: -0.207156 0.376664 -0.130886 -0.026754 0.100304 0.013026 -0.125199
polarizability: 9.88930949e+01 6.69330617e+00 6.68028951e+01 -8.72605913e-03 -2.15443470e-02 2.82404295e+01
1716.lowfreq: -0.0010 -0.0009 -0.0008 2.9480 5.6084 23.7130 111.9418 208.5045 255.6374
frequency: 111.9287 208.4954 255.6352 460.0564 569.3046 584.6309 630.5895 706.2064 729.9717 788.8796 845.9410 860.2739 929.8571 954.8761 982.1197 1001.6420 1030.0175 1048.6869 1138.1113 1212.3255 1256.2538 1296.7843 1392.9166 1422.5847 1489.3362 1553.1607 1658.8537 3095.8246 3105.9506 3207.6724 3223.1838 3251.4190 3269.0735
redmass: 2.7784 3.1839 2.2502 3.7229 2.0902 3.5256 3.1565 1.3896 1.3985 1.7949 6.0373 1.4299 1.3375 3.6196 2.9066 1.1475 1.5025 2.6552 1.8861 1.2821 1.6703 1.3526 4.3157 1.3077 3.7826 4.3909 5.1724 1.0673 1.0849 1.1144 1.0928 1.0986 1.1084
irintensity: 0.0979 1.1224 3.9272 1.0165 21.6009 5.6318 4.2430 2.0582 30.6622 78.6951 23.3137 3.9011 93.9972 9.5041 14.6640 19.6306 8.0449 18.0514 38.9870 0.6269 2.4810 1.5246 2.2153 8.7413 3.5277 2.4710 32.0281 16.4507 4.9708 23.2259 1.9912 0.5107 0.4549
temp: 298.150 k
press: 1.00000 atm
elementType: 8 6 6 6 6 6 6 1 1 1 1 1 1
symmnumber: 1
zpe: 264808.7 jmol-1
zpe.correction: 0.100860 hartree
zpe.thermalcorrener: 0.106918 hartree
zpe.thermalcorrenthalpy: 0.107862 hartree
zpe.thermalcorrgfe: 0.070963 hartree
zpe.sumelectzpe: -306.904170 hartree
zpe.sumelectthermal: -306.898113 hartree
zpe.sumelectthermalent: -306.897168 hartree
zpe.sumelectthermalfe: -306.934067 hartree
dipole: 0.6263 0.3890 0.0018
dipole: 0.7372
quadrupole: -40.2084 -34.1110 -45.6797
quadrupole: -2.6055 0.0003 -0.0069
quadrupole: -0.2087 5.8887 -5.6800 -2.6055 0.0003 -0.0069
hfenergy: -307.0050306 hartree
pointgroup: C01[X(C6H6O1)]
dipole: -0.2469838 -0.1520749 0.0002895 debye
dipolederiv: -0.8681582 -0.1702717 -0.0003766 0.1154788 -0.3264933 0.0002108 0.0002202 -0.0003071 -0.1356045 -0.1003495 -0.0337658 -0.0000332 -0.1187955 -0.0079377 -0.0004837 0.0010106 -0.0000949 0.0318016 -0.1278609 -0.0301631 -0.0001582 0.0013463 -0.0097521 0.0000712 -0.0007028 0.0002634 -0.2165999 0.5460784 0.0766972 0.0000696 0.0106934 0.0250033 0.0002837 -0.0000516 0.0001014 -0.1726314 0.0945256 0.1461812 -0.0000864 0.0332771 0.2118296 0.0002055 0.0002809 0.000385 -0.1427438 0.5032197 0.010955 0.0003873 -0.0637063 0.1563511 0.0017816 -0.0009276 0.0014047 -0.1357749 -0.2671778 -0.0978929 -0.0004742 -0.1909404 0.0346435 0.0025853 -0.000878 0.0025623 -0.4273736 0.0969801 -0.0791993 -0.0000244 -0.0345058 0.0014386 -0.0001585 0.0000508 -0.0002388 0.1968901 0.0912141 -0.0008602 0.000113 0.0231424 0.0096574 -0.000356 0.0001089 -0.0002313 0.229547 0.0293869 0.0592879 0.000158 0.036933 0.0637657 -0.0002175 0.000112 -0.0001654 0.2265318 0.0265615 0.0046597 0.0000368 0.0841492 -0.1150168 -0.0014721 0.0002027 -0.0014366 0.159912 -0.1026143 0.0500979 0.0001125 0.0608023 0.0654398 -0.0007214 0.0003897 -0.0005846 0.1940651 0.0781943 0.0642741 0.000276 0.0421255 -0.1089291 -0.0017289 0.0001841 -0.001658 0.1919806 unknown
polarizability: 98.9446408|6.5682382|66.7510355|0.0488134|0.1097977|28.2407432 unknown
InChI: InChI=1S/C6H6O/c1-2-6-3-4-7-5-6/h2-5H,1H2
charge 0 multiplicity 1
13 atoms
O  1.993347 0.476821 0.000593
C  -0.290731 0.216934 0.001213
C  0.338521 -1.100547 -0.000871
C  0.753696 1.13696 0.002467
C  1.70307 -0.904206 -0.001377
C  -1.716885 0.549319 0.002125
C  -2.744626 -0.345394 -0.003483
H  -0.170885 -2.062294 -0.001576
H  0.797886 2.222867 0.004073
H  2.566474 -1.563277 -0.002618
H  -1.955425 1.622541 0.007906
H  -3.786931 -0.011121 -0.002176
H  -2.574412 -1.428605 -0.009574
