program: Gaussian 09
title: 000181901
version: EM64L-G09RevD.01
frameworkgroup: C1[X(C12H18N2O)]
method: RPBEPBE
basis: SDD
operation: Freq
keyword: #p
keyword: freq=noraman
keyword: PBEPBE/SDD
title: #p freq=noraman PBEPBE/SDD
converged: YES YES NO NO
title: Mulliken charges:
elementType: O N N C C C C C C C C C C C C H H H H H H H H H H H H H H H H H H
charge: -0.333205 -0.403971 -0.150778 -0.549084 -0.380361 0.476751 -0.420708 -0.400507 0.431089 -0.395366 -0.382190 0.314008 -0.805821 -0.630635 -0.664550 0.209481 0.234283 0.260579 0.216341 0.242989 0.231200 0.325289 0.228610 0.227518 0.223539 0.236649 0.222221 0.286316 0.217763 0.219890 0.238570 0.239851 0.234238
chargesum: 0.00000
title: Mulliken charges with hydrogens summed into heavy atoms:
elementType: O N N C C C C C C C C C C C C
charge: -0.333205 -0.078682 -0.150778 -0.105320 0.096559 0.476751 -0.177718 -0.169306 0.431089 -0.166756 -0.154672 0.314008 -0.123412 0.093334 0.048109
polarizability: 1.78151367e+02 -1.01746914e+01 1.53089223e+02 2.03166788e+01 8.72247124e+00 1.03863269e+02
1716.lowfreq: 0.0004 0.0005 0.0007 4.4880 6.7673 13.8220 21.3103 26.5806 31.1975
frequency: 20.5404 26.0045 30.9455 38.6974 76.1234 82.7392 87.4632 134.5127 156.8361 182.0693 214.3955 239.3307 284.5767 306.6230 360.0722 375.1256 383.8153 407.5079 424.8422 456.6150 488.1453 517.9117 561.0148 584.2403 639.4882 700.2898 709.8663 726.1377 785.5383 807.0136 828.7228 852.8183 872.1137 951.3746 958.1110 972.5193 975.4122 990.8166 1014.0664 1037.7453 1046.9891 1060.0043 1098.9052 1102.0708 1122.8991 1136.3088 1180.7949 1191.7263 1202.9477 1213.6686 1223.2712 1247.6278 1266.2094 1309.5989 1320.4442 1343.3641 1366.4364 1374.6623 1397.7438 1406.1339 1416.6113 1443.7346 1448.5541 1469.2931 1472.6709 1473.7761 1476.8205 1479.2293 1492.5478 1502.8026 1505.1814 1510.7149 1581.7405 1610.1647 1624.3845 2935.4745 2958.6233 2974.0723 2991.4004 2997.5507 3005.4836 3029.2715 3054.7770 3058.0700 3082.5059 3085.1293 3093.5907 3107.4702 3110.3485 3110.4549 3130.6069 3137.6094 3569.6506
redmass: 2.9134 1.1726 3.6819 3.2743 3.3481 2.3832 3.3856 1.8559 1.9854 1.5296 2.1237 2.6036 2.7272 3.2974 3.0999 2.8225 2.3855 2.8573 2.6458 3.2171 1.4165 3.2343 2.4413 4.0766 6.6463 3.4985 10.1984 2.7932 2.7841 2.8181 2.2311 1.2615 2.2708 1.4195 2.3717 1.6665 1.5356 1.6640 2.8454 1.8596 1.5574 1.4156 1.2466 2.8299 1.3428 1.3289 1.2547 1.1038 1.9879 3.0815 2.3414 1.5509 4.0961 1.2910 1.2832 1.9287 1.7227 3.7073 1.2244 2.7984 1.1546 1.1473 1.1357 1.1112 1.0786 1.0707 1.0838 1.1102 1.0459 1.1012 1.9785 2.3938 5.9417 5.4548 6.4346 1.0397 1.0368 1.0384 1.0612 1.0654 1.0990 1.1022 1.0953 1.1001 1.0997 1.0997 1.0950 1.0869 1.0959 1.0872 1.0960 1.0972 1.0764
irintensity: 0.7040 1.3087 1.9728 1.2083 6.6793 1.3131 7.7943 1.1683 1.8491 0.3679 1.7054 1.0976 1.1122 3.3366 14.7326 8.0332 3.6101 0.2560 9.1745 17.8710 117.0238 7.2863 33.2769 2.4386 0.0086 0.8068 19.0368 3.9086 5.5908 8.3568 30.6243 0.3581 4.5898 2.7184 6.9004 9.1667 4.9233 9.5506 2.4797 29.1408 20.0918 14.0784 0.7020 13.8492 7.0801 0.2622 29.7946 0.9668 116.3222 5.6932 1.3469 53.1563 6.8904 5.1413 13.6130 79.8437 26.7567 1.0899 9.8639 0.7855 34.2589 34.2560 2.3738 7.9674 17.0549 11.3841 62.2538 92.8142 6.7360 55.0367 226.6024 86.0660 0.1732 243.1460 0.8866 58.7525 96.0819 39.9306 30.6612 38.3623 44.5263 49.7941 23.4076 25.0906 19.2070 6.7028 20.1528 7.6205 0.7713 22.2359 49.1290 0.7559 8.4332
temp: 298.150 k
press: 1.00000 atm
elementType: 8 7 7 6 6 6 6 6 6 6 6 6 6 6 6 1 1 1 1 1 1 1 1 1 1 1 1 1 1 1 1 1 1
symmnumber: 1
zpe: 734592.7 jmol-1
zpe.correction: 0.279792 hartree
zpe.thermalcorrener: 0.296380 hartree
zpe.thermalcorrenthalpy: 0.297324 hartree
zpe.thermalcorrgfe: 0.232535 hartree
zpe.sumelectzpe: -651.677202 hartree
zpe.sumelectthermal: -651.660614 hartree
zpe.sumelectthermalent: -651.659669 hartree
zpe.sumelectthermalfe: -651.724458 hartree
dipole: -2.5098 3.4264 -1.7054
dipole: 4.5769
quadrupole: -94.2443 -83.9526 -91.2162
quadrupole: 10.9545 -0.0925 3.0304
quadrupole: -4.4399 5.8518 -1.4119 10.9545 -0.0925 3.0304
hfenergy: -651.9569932 hartree
pointgroup: C01 [X(C12H18N2O1)]
dipole: -0.97095 -1.3412199 0.7077227 debye
polarizability: 177.813125|9.943616|153.7063322|-20.8761296|7.2213628|103.5844022 unknown
InChI: InChI=1S/C12H18N2O/c1-10-4-6-11(7-5-10)8-9-13-12(15)14(2)3/h4-7,13H,8-9H2,1-3H3
charge 0 multiplicity 1
33 atoms
O  3.429957 1.199467 -0.49844
N  1.535276 0.565058 0.716212
N  3.211991 -1.02995 0.212648
C  -0.118901 1.989635 -0.56129
C  0.920818 1.89129 0.598449
C  -1.274411 1.016517 -0.39326
C  -1.248292 -0.265736 -1.001247
C  -2.386784 1.334915 0.429469
C  -3.405516 -0.874391 0.027884
C  -2.293958 -1.194229 -0.792795
C  -3.431373 0.407859 0.636341
C  2.76359 0.294145 0.104224
C  -4.548704 -1.856516 0.221568
C  4.49447 -1.391362 -0.406865
C  2.471028 -2.058796 0.953484
H  -0.492806 3.031729 -0.588815
H  0.415272 1.804992 -1.511213
H  1.737651 2.609336 0.415149
H  0.432654 2.146905 1.558292
H  -0.407227 -0.531421 -1.653774
H  -2.4362 2.321345 0.908513
H  0.948065 -0.194667 1.059007
H  -2.250812 -2.176803 -1.279732
H  -4.281109 0.682259 1.274213
H  -5.015854 -1.744417 1.216231
H  -5.343435 -1.696628 -0.533143
H  -4.207082 -2.90187 0.120352
H  4.88822 -0.495077 -0.910695
H  4.364821 -2.198823 -1.153899
H  5.227866 -1.725052 0.353614
H  2.294194 -1.763121 2.007412
H  3.062919 -2.988128 0.966325
H  1.492968 -2.297767 0.484182
