program: Gaussian 09
title: 000181888
version: EM64L-G09RevD.01
frameworkgroup: C1[X(C10H10O4)]
method: RPBEPBE
basis: SDD
operation: Freq
keyword: #pfreq=noraman
keyword: PBEPBE/SDD
title: #p freq=noraman PBEPBE/SDD
converged: YES YES NO NO
title: Mulliken charges:
elementType: O O O O C C C C C C C C C C H H H H H H H H H H
charge: -0.405402 -0.235882 -0.439983 -0.251023 -0.327315 0.512520 -0.689345 -0.433320 -0.365484 0.180395 0.252578 -0.349456 -0.333953 0.111975 0.251077 0.232013 0.243617 0.226258 0.241130 0.269086 0.272294 0.274590 0.378675 0.384957
chargesum: 0.00000
title: Mulliken charges with hydrogens summed into heavy atoms:
elementType: O O O O C C C C C C C C C C
charge: -0.026727 -0.235882 -0.055027 -0.251023 -0.076239 0.512520 0.012544 -0.192191 -0.096398 0.180395 0.252578 -0.077162 -0.059363 0.111975
polarizability: 1.74161161e+02 1.22625126e-01 1.16739490e+02 -5.13883674e+00 5.78509210e+00 7.48189831e+01
1716.lowfreq: -16.1968 -4.6937 -0.0003 0.0004 0.0006 2.7576 27.6749 35.7717 63.6408
frequency: 27.4715 35.7656 63.6283 75.7953 119.2967 154.6482 200.0784 219.7034 230.0385 308.4720 316.1625 347.7782 406.6389 441.0519 483.1412 508.9044 562.8355 596.4481 604.6320 622.4172 633.4362 679.9184 693.7726 743.3499 765.9425 793.3002 829.1070 863.4677 874.2308 986.7451 990.9131 999.7540 1003.0525 1024.3755 1036.9845 1070.4615 1093.0685 1125.6479 1150.6025 1195.2833 1201.8435 1239.4654 1271.1017 1315.8171 1323.1224 1347.2410 1390.3629 1393.8801 1415.0890 1470.4586 1475.8342 1499.7085 1577.6549 1618.5170 1643.2684 1659.8535 2995.4665 3049.7079 3094.4862 3107.7242 3133.5406 3141.6913 3162.3995 3178.0296 3504.5628 3532.2463
redmass: 5.4557 8.0579 6.4234 6.1897 5.9805 5.6228 3.9362 1.0781 3.5829 4.9918 5.3981 5.6400 2.8490 4.7018 6.0617 3.1960 3.0356 1.3158 2.8654 1.9725 6.1859 2.4540 3.5304 4.5360 4.3218 3.8382 3.0277 1.2958 1.6395 1.7128 1.5844 1.4059 4.5467 2.7469 2.6012 1.5770 2.2839 1.4327 1.7044 1.4071 1.7114 1.5902 1.5159 1.5215 2.2802 1.9915 1.1916 4.8290 2.7369 1.0566 1.0547 2.5122 7.1926 6.2196 8.6808 8.1785 1.0350 1.0852 1.1004 1.1008 1.0892 1.0903 1.0958 1.0952 1.0639 1.0642
irintensity: 0.8402 2.4372 1.0442 0.6031 0.5012 0.2517 0.8218 0.6045 0.8507 4.7127 3.1637 1.7162 0.4265 24.5190 8.3666 41.3994 91.9928 55.7822 37.4250 25.7845 8.5119 111.0100 88.9354 8.6859 4.3365 1.4146 4.5149 4.3350 37.2794 5.2626 10.5644 7.5374 214.3818 145.4081 189.5626 27.8088 57.0089 12.8960 109.7002 2.4252 0.7714 0.7568 4.0618 33.4969 83.5676 36.5044 19.4919 11.2521 27.2790 12.0162 12.8988 15.1867 13.1463 61.3917 335.1840 157.7962 24.0780 6.0557 32.6741 15.0676 8.5482 1.7561 4.8425 0.5216 25.0927 47.2762
temp: 298.150 k
press: 1.00000 atm
elementType: 8 8 8 8 6 6 6 6 6 6 6 6 6 6 1 1 1 1 1 1 1 1 1 1
symmnumber: 1
zpe: 476241.7 jmol-1
zpe.correction: 0.181391 hartree
zpe.thermalcorrener: 0.194641 hartree
zpe.thermalcorrenthalpy: 0.195585 hartree
zpe.thermalcorrgfe: 0.139788 hartree
zpe.sumelectzpe: -686.964048 hartree
zpe.sumelectthermal: -686.950798 hartree
zpe.sumelectthermalent: -686.949854 hartree
zpe.sumelectthermalfe: -687.005650 hartree
dipole: -1.7230 -0.1894 0.2115
dipole: 1.7462
quadrupole: -79.2962 -82.1387 -78.1516
quadrupole: 13.0473 3.0610 -2.1628
quadrupole: 0.5659 -2.2765 1.7106 13.0473 3.0610 -2.1628
hfenergy: -687.1454386 hartree
pointgroup: C01 [X(C10H10O4)]
dipole: 0.6760564 0.0922795 0.080046 debye
dipolederiv: -0.59937 -0.1329863 0.3011108 -0.0781157 -0.2790103 0.1310235 0.4370345 0.1976772 -1.0616579 -0.5151012 0.2024368 0.0253969 0.2204461 -0.7964784 0.2666126 0.1681965 0.0400033 -0.6118484 -0.6510252 -0.3897154 0.1413822 -0.5648062 -1.0000323 0.172385 0.2123506 0.1939242 -0.479123 -1.0859004 0.2134187 -0.1973534 0.1666184 -0.6758317 0.1736198 -0.1855428 0.181096 -0.4370583 -0.1909752 0.1493191 0.07362 0.1894836 0.017486 -0.0664621 -0.0992815 -0.0762228 -0.0266409 0.5334035 -0.0265404 0.0526226 0.1248983 0.0104638 -0.0691462 0.1176954 -0.065538 -0.036165 -0.0445795 0.0084652 -0.014133 0.0102361 0.0367525 -0.0110083 0.0695086 0.0479214 0.0389607 -0.3107893 0.1396884 -0.0726671 0.1236618 0.0494049 -0.0539558 -0.0650207 -0.0666007 -0.1269533 -0.2816462 -0.1392676 0.0447192 -0.222375 -0.0791558 -0.0558669 0.0757438 -0.0409868 -0.1116472 0.7032232 -0.2763347 -0.4646682 -0.4817366 0.951036 -0.2985065 -0.7306441 -0.1847918 1.274914 -0.7869164 -0.0948364 -0.0694193 -0.1015728 -0.0620114 0.0122333 -0.0677306 0.0125256 -0.0159689 0.1461195 -0.0831836 0.0739211 0.1530006 0.0040591 -0.0279578 -0.0400346 -0.0547741 -0.0715978 0.1966927 0.1256545 -0.0115692 -0.0832453 0.0177102 -0.0655166 0.064725 -0.0307226 -0.0800523 2.0608891 0.1931344 0.1717352 0.356705 1.2469897 -0.3947829 0.1205405 -0.415794 0.4279739 0.0554128 -0.0020709 -0.0061021 -0.0402787 -0.0451254 0.0614518 0.0334884 0.0653633 -0.0019197 0.0584022 0.1042504 0.0623803 0.0825275 -0.018337 -0.080502 0.056124 -0.0624374 0.0222376 0.1024393 -0.0548009 0.0199471 -0.0404047 -0.0423936 0.1025665 0.0129913 0.0322122 0.0481928 -0.1850971 -0.067416 -0.0634381 -0.0572381 0.0952561 -0.0086446 -0.0670618 -0.0094397 0.0501173 0.0342445 -0.095157 0.0248105 -0.0797022 -0.0220389 0.060145 0.0239247 0.059146 0.1195369 0.0644065 0.0593147 -0.0500083 0.0712109 0.0482628 0.0512226 -0.040902 0.0471867 0.1124574 0.0684451 0.0669237 -0.0402337 0.0381526 0.0546423 0.0505055 -0.0315283 0.0542705 0.1267756 0.0929725 -0.0436003 0.0109766 -0.050139 0.0238319 0.0498654 0.0132843 0.0496097 0.1357569 0.3647625 0.0938386 0.0427896 0.1317044 0.1278579 -0.0448662 0.0126672 -0.0082701 0.3325354 0.1699871 0.0494651 -0.0558198 0.1309691 0.3366615 0.0455849 -0.0905285 0.034642 0.3711743 unknown
polarizability: 173.770342|1.8344337|110.1005565|7.7750323|-16.3212476|81.8487349 unknown
InChI: InChI=1S/C10H10O4/c1-6(9(11)12)7-2-4-8(5-3-7)10(13)14/h2-6,11,13H,1H3
charge 0 multiplicity 1
24 atoms
O  3.630004 -0.10679 -1.543149
O  3.373839 -1.618224 0.199366
O  -3.86554 -1.361517 0.283241
O  -4.18304 0.72888 -0.67524
C  2.380897 0.651708 0.383344
C  0.873618 0.412697 0.209742
C  2.770232 0.75927 1.881794
C  0.057586 1.423638 -0.358557
C  0.271882 -0.796921 0.647158
C  3.162017 -0.482067 -0.278577
C  -1.928904 0.03006 -0.039029
C  -1.332883 1.23855 -0.481391
C  -1.117345 -0.989098 0.523834
C  -3.399341 -0.122656 -0.188681
H  2.650129 1.584712 -0.140272
H  2.180798 1.555697 2.367145
H  2.575101 -0.192504 2.403553
H  3.842961 0.997649 1.99323
H  0.515261 2.356822 -0.706568
H  0.89731 -1.589834 1.072227
H  -1.972946 2.012726 -0.917014
H  -1.584767 -1.919919 0.856588
H  4.102227 -0.876821 -1.963717
H  -4.850995 -1.399663 0.154673
