program: Gaussian 09
title: 000181897
version: EM64L-G09RevD.01
frameworkgroup: C1[X(C17H14O2)]
method: RPBEPBE
basis: SDD
operation: Freq
keyword: #pfreq=noraman
keyword: PBEPBE/SDD
title: #p freq=noraman PBEPBE/SDD
converged: YES YES NO NO
title: Mulliken charges:
elementType: O O C C C C C C C C C C C C C C C C C H H H H H H H H H H H H H H
charge: -0.178907 -0.232865 -0.276779 -0.228245 -0.451110 0.416688 -0.561161 -0.530011 0.132505 -0.085871 0.090353 -0.424710 0.213008 0.413390 -0.498932 -0.383168 -0.434258 -0.246421 -0.246781 0.253677 0.264668 0.237445 0.222641 0.276000 0.237700 0.256959 0.260205 0.240997 0.241728 0.316140 0.241891 0.231529 0.231699
chargesum: 0.00000
title: Mulliken charges with hydrogens summed into heavy atoms:
elementType: O O C C C C C C C C C C C C C C C C C
charge: -0.178907 -0.232865 -0.023102 0.036422 0.008976 0.416688 -0.047461 -0.012847 0.132505 -0.085871 0.090353 -0.183713 0.213008 0.413390 -0.257204 -0.067028 -0.192367 -0.014893 -0.015082
polarizability: 2.51663634e+02 6.29597957e+00 1.97991993e+02 -1.92267695e+01 -5.68907888e+00 1.07797879e+02
1716.lowfreq: -11.3752 -8.9177 -0.0005 -0.0001 0.0009 6.7926 29.7576 47.2186 73.7599
frequency: 29.5733 47.1953 73.7538 92.8013 132.2467 194.7277 221.1294 234.4878 257.5627 306.1454 351.1613 368.6554 387.9858 415.7516 451.9686 468.4382 483.1511 507.6838 520.9791 540.1983 546.1308 582.4235 619.1400 643.6950 673.5501 683.7008 699.7201 723.4407 761.6723 774.4024 810.1846 816.6477 826.8822 844.9431 873.8486 899.9275 928.8684 932.1083 969.9212 971.1345 984.5925 988.1763 1014.1836 1018.7652 1034.7946 1041.6743 1085.8514 1102.3763 1128.2065 1140.8856 1152.4117 1164.4401 1173.7724 1183.7499 1198.4680 1223.2344 1234.9669 1242.3882 1254.8180 1271.2425 1278.5744 1283.1957 1314.1473 1325.9755 1332.1932 1352.2058 1401.7096 1407.4571 1423.3116 1428.6929 1434.3578 1456.0748 1474.8514 1512.4743 1560.3073 1573.7368 1603.7590 1626.2209 1661.9567 2965.3691 2986.3611 2990.9725 2994.5785 3010.1879 3076.5753 3079.1338 3085.2470 3117.1221 3121.7631 3136.7130 3141.6874 3159.2037 3192.0839
redmass: 8.1993 4.0722 9.2136 3.9804 3.0916 4.1175 4.1736 2.6930 3.9677 4.4983 7.0252 4.5140 3.5359 4.1673 4.4252 3.9220 3.7248 4.2120 3.7390 3.9847 4.4302 2.8992 4.8369 5.5268 3.6359 3.5143 4.9543 3.4358 1.8473 1.9451 3.8794 2.3032 4.6871 1.5180 2.7698 1.5821 2.6444 2.0526 2.5535 1.3515 2.7851 1.4146 2.1808 1.3271 2.5742 2.4756 1.4169 2.5012 1.5269 1.8714 1.4898 1.4402 1.1623 1.2839 1.5961 2.1857 1.5743 1.9322 2.0015 1.5541 1.6994 1.6158 1.4510 2.0804 1.4758 2.8232 3.9169 4.5734 2.7371 1.0814 1.0929 2.2801 1.1014 3.5234 7.7838 8.7557 6.2575 6.6700 12.2086 1.0795 1.0704 1.0771 1.0658 1.0694 1.0955 1.0953 1.1011 1.0863 1.0868 1.0909 1.0975 1.0986 1.0946
irintensity: 1.7828 1.1169 2.7896 1.9539 3.1234 0.7363 1.3544 7.6799 1.1621 0.4585 0.4469 3.7609 0.8547 1.1717 5.6340 5.1030 8.3953 1.9099 8.6620 1.3643 12.0036 4.2305 1.8815 1.2982 8.2610 1.2385 0.3319 0.9060 14.3315 31.9439 3.9114 6.8496 0.6506 69.3298 1.2662 2.7375 9.8959 7.0225 4.3806 0.6839 4.1761 3.0172 18.7664 3.7037 14.2936 3.7068 17.3795 44.8182 0.1697 16.8630 15.8445 7.0981 9.0520 14.3221 3.9239 64.6638 14.7294 24.8794 9.4740 5.1670 11.3710 4.1827 0.6552 32.6744 10.0102 16.6915 7.1473 8.2048 20.3213 24.0911 13.6004 8.6362 13.5393 49.1741 0.5194 131.3943 21.2953 27.0160 169.9963 25.3185 3.1957 20.8001 3.3316 54.2579 10.5354 3.2172 34.3385 3.9052 2.0654 15.8133 29.8580 31.5770 20.8558
temp: 298.150 k
press: 1.00000 atm
elementType: 8 8 6 6 6 6 6 6 6 6 6 6 6 6 6 6 6 6 6 1 1 1 1 1 1 1 1 1 1 1 1 1 1
symmnumber: 1
zpe: 686747.0 jmol-1
zpe.correction: 0.261568 hartree
zpe.thermalcorrener: 0.275974 hartree
zpe.thermalcorrenthalpy: 0.276918 hartree
zpe.thermalcorrgfe: 0.219551 hartree
zpe.sumelectzpe: -805.355601 hartree
zpe.sumelectthermal: -805.341195 hartree
zpe.sumelectthermalent: -805.340251 hartree
zpe.sumelectthermalfe: -805.397618 hartree
dipole: -0.7637 5.8996 -1.8812
dipole: 6.2391
quadrupole: -101.3610 -112.4370 -111.1352
quadrupole: 9.1690 -9.6161 3.2926
quadrupole: 6.9500 -4.1259 -2.8241 9.1690 -9.6161 3.2926
hfenergy: -805.6171687 hartree
pointgroup: C01 [X(C17H14O2)]
dipole: -0.3238071 -2.3561621 0.6074874 debye
polarizability: 251.1793298|-7.7382732|198.4568546|20.2121522|-0.8849822|107.817322 unknown
InChI: InChI=1S/C17H14O2/c18-15-8-7-12-13-6-5-10-3-1-2-4-11(10)17(13)16(19)9-14(12)15/h1-6,12,14H,7-9H2
charge 0 multiplicity 1
33 atoms
O  3.735938 1.463499 -1.078434
O  0.105089 2.700055 0.399995
C  1.949237 -1.127248 0.79524
C  2.721356 0.212194 0.812169
C  2.683038 -1.945208 -0.330678
C  0.449476 -0.97391 0.523015
C  1.91379 1.409848 1.330619
C  3.027628 -0.898719 -1.414884
C  3.23136 0.405984 -0.636322
C  -0.217844 0.272987 0.387884
C  0.548686 1.538652 0.65147
C  -0.29221 -2.193707 0.407325
C  -1.646617 0.296836 0.067509
C  -2.360437 -0.961243 -0.054635
C  -1.654446 -2.192226 0.13548
C  -2.404056 1.502856 -0.12504
C  -3.761682 -0.975322 -0.35335
C  -3.772261 1.458458 -0.418185
C  -4.464438 0.216002 -0.535269
H  2.059773 -1.655967 1.762301
H  3.633295 0.095327 1.435647
H  2.074569 -2.77706 -0.720191
H  3.611575 -2.377293 0.088612
H  2.461877 2.352396 1.162994
H  1.742164 1.304617 2.421206
H  2.17689 -0.745885 -2.108929
H  3.91023 -1.139527 -2.031032
H  0.23348 -3.14554 0.545944
H  -2.206509 -3.136724 0.058845
H  -1.886363 2.459719 -0.050469
H  -4.270667 -1.943071 -0.436768
H  -4.319225 2.396938 -0.562428
H  -5.535194 0.202286 -0.76564
