program: Gaussian 09
title: 000181917
version: EM64L-G09RevD.01
frameworkgroup: C1[X(C15H24O11)]
method: RPBEPBE
basis: SDD
operation: Freq
keyword: #p
keyword: freq=noraman
keyword: PBEPBE/SDD
title: #p freq=noraman PBEPBE/SDD
converged: YES YES NO NO
title: Mulliken charges:
elementType: O O O O O O O O O O O C C C C C C C C C C C C C C C H H H H H H H H H H H H H H H H H H H H H H H H
charge: -0.353905 -0.198033 -0.331691 -0.455305 -0.496982 -0.464935 -0.429065 -0.425723 -0.415434 -0.417242 -0.455695 -0.292901 0.266172 -0.144537 -0.555696 -0.443505 0.108800 0.188656 -0.109530 -0.204979 0.119629 -0.184830 -0.260663 -0.102576 -0.737852 -0.199657 0.283775 0.234843 0.245280 0.239924 0.230295 0.228500 0.263464 0.262621 0.295223 0.273805 0.243856 0.358353 0.244937 0.239144 0.235604 0.249798 0.265306 0.367886 0.352246 0.360655 0.383129 0.343167 0.385271 0.410397
chargesum: 0.00000
title: Mulliken charges with hydrogens summed into heavy atoms:
elementType: O O O O O O O O O O O C C C C C C C C C C C C C C C
charge: -0.353905 -0.198033 -0.331691 -0.096952 -0.129096 -0.112689 -0.068410 -0.042594 -0.072267 -0.031971 -0.045298 -0.009126 0.266172 0.090306 -0.070492 0.015290 0.372263 0.188656 0.153091 0.090244 0.119629 0.088975 -0.016807 0.142361 -0.013305 0.065649
polarizability: 2.38937905e+02 -5.17823591e+00 1.94539329e+02 -6.37319771e+00 -2.38128823e+00 1.51165103e+02
1716.lowfreq: -0.0007 -0.0006 -0.0005 2.4898 7.8277 11.8606 24.1433 38.5512 48.1953
frequency: 23.0888 38.3523 48.1707 72.6546 87.8807 105.5674 116.7474 129.5802 144.3482 155.5591 163.7464 171.3176 217.2366 225.1498 230.3434 232.6304 249.4321 266.2499 270.3864 281.6735 289.5016 294.5587 301.2807 308.9020 333.7142 339.1734 351.5560 357.0342 363.1638 380.2950 386.8093 413.4080 434.6220 441.6838 456.9224 464.2934 481.3784 505.4370 514.5317 527.8014 536.1900 546.0458 566.7062 574.9745 589.0932 618.3766 639.1661 652.8205 695.3500 710.8109 711.6015 723.8771 735.0667 749.6150 773.4800 785.4989 796.2661 822.8532 829.5908 833.7862 845.7855 894.1400 909.6720 910.4446 913.5491 926.1427 945.4027 955.1527 964.5001 990.1454 997.5023 999.2707 1018.8516 1021.4485 1027.8972 1045.5767 1058.1242 1077.0240 1083.2756 1097.2083 1111.2659 1123.9177 1130.0587 1132.5334 1159.1875 1168.6974 1189.7492 1190.4112 1210.9147 1224.8603 1225.7443 1234.7001 1243.7162 1249.2685 1262.7052 1270.7855 1285.7230 1287.4766 1295.7892 1299.9374 1302.2839 1307.7162 1314.3414 1329.4328 1338.7396 1347.3707 1363.0433 1375.0383 1387.2145 1388.5537 1394.9664 1396.9443 1413.8714 1423.8540 1452.2982 1453.5171 1457.8770 1465.1326 1487.3871 1636.9376 3002.8934 3005.8849 3007.7589 3010.1236 3019.0150 3035.5762 3053.9252 3055.9158 3068.7765 3072.1252 3094.8820 3097.0228 3114.6272 3116.1697 3165.5957 3195.5144 3267.6697 3332.0226 3343.0511 3397.3403 3537.4041 3543.3243 3561.0176 3592.8438
redmass: 5.6235 5.3242 6.0410 6.3172 2.7714 5.0420 5.1542 5.1125 6.1802 5.2234 5.2396 7.3926 3.5288 3.4974 1.6940 2.6853 3.3850 2.5013 3.3521 2.7737 2.6452 3.9599 2.5451 3.0372 4.9514 3.2181 3.0334 3.0131 2.5915 3.2207 1.5901 4.1809 3.3968 4.1102 1.5404 4.6188 4.3266 4.4330 5.2736 4.1901 3.4798 5.0983 3.1538 2.4018 1.4899 1.6806 3.3743 4.1784 1.1877 3.3707 3.4643 1.9445 1.6660 1.9436 2.5089 4.6785 3.8028 4.3574 3.8507 2.7135 2.5665 3.9318 3.0134 1.9351 1.9058 3.5251 2.6042 3.4827 3.2668 3.0616 4.2144 2.9387 3.5929 5.0248 2.8398 4.0730 4.6732 1.7026 2.5392 3.2764 2.9239 2.8100 2.5619 2.1830 1.7884 1.2863 1.5624 2.3996 1.2978 1.2703 1.4594 1.2374 1.3555 1.2049 1.4457 1.2802 1.2551 1.2634 1.2889 1.2998 1.3941 1.3053 1.6754 1.3043 1.2771 1.2962 1.4447 1.6827 1.3752 1.3425 1.1853 1.2109 1.4513 1.6205 1.2211 1.0934 1.0650 1.0995 1.0573 7.1384 1.0369 1.0682 1.0823 1.0754 1.0660 1.0867 1.0881 1.0867 1.1023 1.0855 1.1026 1.0978 1.1014 1.0874 1.0866 1.1028 1.0673 1.0660 1.0666 1.0634 1.0650 1.0650 1.0657 1.0668
irintensity: 1.3544 1.2777 1.7251 1.5767 0.2132 2.8940 0.9019 1.2869 1.0125 9.8435 4.2480 1.0322 6.2270 12.3706 4.7079 12.6977 34.6472 16.1496 6.4491 30.7654 9.6010 43.5318 49.0980 1.6385 14.5805 12.7560 23.2522 24.8549 13.4162 4.9625 136.5842 3.9112 28.0839 25.6360 117.9488 80.0699 9.2430 25.1531 8.9271 5.3666 29.4208 18.2039 10.3072 143.4206 12.6334 53.7975 44.7305 32.6631 66.3141 51.8123 44.0027 16.6738 28.2222 90.4438 16.8278 54.3463 6.7727 224.1899 39.0076 66.2969 129.0942 134.0784 33.8673 27.9798 48.6823 47.6542 4.8976 35.6131 330.6793 155.2529 131.1416 61.7473 33.6145 133.6024 42.9257 19.7226 144.4995 67.0038 25.2707 44.4816 39.4101 43.3461 39.0608 9.3327 51.8655 20.3099 45.1460 27.8701 50.3157 32.5510 19.4557 11.0648 38.5058 30.2949 7.8825 5.0991 14.8551 12.7771 4.6211 0.6231 30.7433 8.0779 20.8460 12.8244 6.6680 15.2168 0.9877 27.1798 47.1100 13.7236 27.1423 39.2237 16.3368 76.5337 22.7372 1.1161 11.8079 14.8300 12.7564 110.3625 14.5628 10.0744 3.2895 12.3913 32.1948 39.2958 6.8531 20.9357 9.7907 11.8880 26.5163 16.6283 8.9068 40.4935 0.6969 11.1908 212.1774 108.1289 504.1129 62.5782 19.8496 9.2786 12.9804 15.2717
temp: 298.150 k
press: 1.00000 atm
elementType: 8 8 8 8 8 8 8 8 8 8 8 6 6 6 6 6 6 6 6 6 6 6 6 6 6 6 1 1 1 1 1 1 1 1 1 1 1 1 1 1 1 1 1 1 1 1 1 1 1 1
symmnumber: 1
zpe: 1039392.8 jmol-1
zpe.correction: 0.395884 hartree
zpe.thermalcorrener: 0.421504 hartree
zpe.thermalcorrenthalpy: 0.422448 hartree
zpe.thermalcorrgfe: 0.342938 hartree
zpe.sumelectzpe: -1411.325787 hartree
zpe.sumelectthermal: -1411.300167 hartree
zpe.sumelectthermalent: -1411.299223 hartree
zpe.sumelectthermalfe: -1411.378733 hartree
dipole: 4.1513 -2.0240 -0.4838
dipole: 4.6437
quadrupole: -135.1407 -159.0480 -160.4442
quadrupole: -16.5419 -11.8088 -2.9554
quadrupole: 16.4036 -7.5037 -8.8999 -16.5419 -11.8088 -2.9554
hfenergy: -1411.7216711 hartree
pointgroup: C01 [X(C15H24O11)]
dipole: 1.6856104 0.6741706 0.2049226 debye
polarizability: 239.4788393|1.841658|194.1598799|5.9927962|-1.5951873|151.0036171 unknown
InChI: InChI=1S/C15H24O11/c1-13(21)9(18)8(17)11(26-15(13,23)12(19)20)25-10-7-6(16)2-3-14(7,22)4-5-24-10/h4-12,16-23H,2-3H2,1H3
charge 0 multiplicity 1
50 atoms
O  0.176921 0.472333 0.039866
O  -1.657233 -0.287823 -1.35253
O  1.005379 -1.71819 -0.272795
O  3.99798 -0.629445 -1.604245
O  3.131771 1.910269 -1.195666
O  -4.645381 0.185732 0.943831
O  -3.591375 2.80375 0.842487
O  -3.596089 -1.592668 -1.273586
O  -0.717728 3.011994 0.200833
O  -1.448525 -0.920171 1.690863
O  -1.628655 -2.764449 0.120302
C  2.559862 0.092218 0.310988
C  3.755535 -0.799989 -0.14756
C  3.127394 1.518393 0.240766
C  4.925382 -0.189901 0.669279
C  4.576772 1.338253 0.802483
C  1.312408 -0.256955 -0.47592
C  -3.669938 0.526014 -0.11726
C  -0.870118 0.848424 -0.9821
C  -2.784957 1.621089 0.553243
C  -2.816647 -0.723437 -0.457721
C  -1.650444 2.059496 -0.391605
C  3.38652 -2.245807 0.059875
C  2.080406 -2.605429 -0.016479
C  -4.407755 1.040767 -1.36872
C  -2.27344 -1.595626 0.740573
H  2.362779 -0.130272 1.378061
H  2.53133 2.252662 0.812038
H  5.880666 -0.365396 0.147988
H  4.986298 -0.66042 1.66728
H  4.61685 1.66127 1.858262
H  5.282444 1.974365 0.238883
H  1.425239 -0.096911 -1.562375
H  -0.322871 1.142905 -1.893998
H  -2.380382 1.19337 1.492285
H  -2.103029 2.615989 -1.229281
H  4.151064 -3.01082 0.214001
H  3.927298 0.351823 -1.80387
H  1.698187 -3.622057 0.105212
H  -3.7245 1.139368 -2.229396
H  -5.190546 0.324328 -1.670096
H  -4.859045 2.021642 -1.146471
H  -3.133277 -1.987909 1.301542
H  3.37002 2.865314 -1.284951
H  -5.350418 -0.382506 0.540182
H  -4.342659 2.492621 1.412821
H  -3.110577 -2.469016 -1.276872
H  -0.207142 2.530721 0.902637
H  -0.679964 -0.473976 1.21952
H  -0.736312 -2.462939 -0.227602
