program: Gaussian 09
title: 000181865
version: EM64L-G09RevD.01
frameworkgroup: C1[X(C20H11Cl)]
method: RPBEPBE
basis: SDD
operation: Freq
keyword: #p
keyword: freq=noraman
keyword: PBEPBE/SDD
title: #p freq=noraman PBEPBE/SDD
converged: NO YES NO YES
title: Mulliken charges:
elementType: Cl C C C C C C C C C C C C C C C C C C C C H H H H H H H H H H H
charge: -0.044271 -0.157678 -0.161756 0.357602 0.298345 0.293409 0.294145 0.624297 0.467259 -0.442915 -0.421812 -0.406054 -0.411279 -0.431941 -0.447010 -0.468201 -0.465233 -0.302214 -0.264875 -0.270489 -0.271482 0.236585 0.233962 0.230684 0.231929 0.263149 0.241085 0.241130 0.257393 0.233553 0.231364 0.231318
chargesum: 0.00000
title: Mulliken charges with hydrogens summed into heavy atoms:
elementType: Cl C C C C C C C C C C C C C C C C C C C C
charge: -0.044271 -0.157678 -0.161756 0.357602 0.298345 0.293409 0.294145 0.624297 0.467259 -0.206330 -0.187850 -0.175369 -0.179350 -0.431941 -0.183861 -0.227116 -0.224102 -0.044821 -0.031321 -0.039125 -0.040164
polarizability: 4.08491762e+02 9.94176797e+00 2.79264023e+02 -7.18684279e-04 7.33500987e-04 8.15008125e+01
1716.lowfreq: -8.9752 -8.9406 -0.0018 -0.0015 0.0004 6.3165 29.6283 60.6320 121.6444
frequency: 29.6237 60.6283 121.6434 151.9026 176.6886 180.1945 215.3063 256.0006 264.3411 297.4883 327.8324 356.1643 423.1749 429.5410 447.3844 455.9948 472.8242 490.4653 526.4978 532.8380 545.4943 547.4488 565.7348 591.5287 634.9660 651.0249 654.6886 682.4323 765.7030 770.3120 770.7139 777.0050 780.7693 788.4464 822.6592 826.8733 832.3310 895.7975 899.2066 921.1947 929.4657 941.9108 950.9991 979.6573 982.1786 986.9257 990.4358 1042.3792 1069.3416 1096.8994 1123.3150 1147.4700 1155.0304 1181.7205 1198.4913 1201.6719 1206.6310 1225.9036 1238.9907 1306.0169 1308.4157 1341.4125 1364.2644 1370.0076 1389.8485 1394.4458 1409.5884 1420.6652 1438.3082 1445.8889 1478.0475 1509.9635 1525.1399 1566.6905 1582.3495 1589.4542 1595.2259 1610.3510 1623.7665 3126.2548 3127.8221 3137.3410 3143.4528 3145.0869 3154.4557 3158.7313 3164.6611 3167.3987 3174.1947 3175.6611
redmass: 4.9049 7.9286 4.1985 4.0592 10.3053 4.3096 3.8427 9.1428 4.3506 6.9725 5.2923 6.8513 5.3344 4.3630 6.8952 3.2111 3.3687 5.7500 6.5140 3.7246 7.3540 6.9499 4.5370 6.0605 3.4509 8.0187 2.2971 3.8081 1.8417 6.0400 1.5657 1.4794 5.6729 5.4910 6.8907 1.8262 1.6280 2.7372 1.4783 1.5403 1.7253 6.4392 1.4922 1.3541 4.3405 1.3681 1.3765 5.6464 2.6524 1.8598 1.9461 1.5184 1.6397 1.9713 1.3666 1.3536 1.3763 1.8553 1.7590 1.9477 2.2814 3.5024 2.4243 3.0480 5.8117 5.6959 4.7388 4.3135 2.6058 2.4066 2.6114 5.5631 4.7061 5.5955 5.7971 5.1503 7.6694 5.9230 7.3177 1.0867 1.0861 1.0872 1.0917 1.0914 1.0906 1.0955 1.0959 1.0937 1.0971 1.0957
irintensity: 0.0051 0.0011 0.7135 0.1759 0.1608 9.3912 0.0004 2.0576 0.0950 0.8369 0.5819 0.0643 0.8359 1.1201 7.7169 0.5372 0.0453 3.0070 0.2460 2.1089 8.0416 3.6515 4.2749 0.3138 0.1594 17.6889 0.0002 3.9866 38.7897 23.1756 15.1377 2.0758 0.1326 2.4246 6.9922 0.5613 193.7267 0.9110 0.0857 0.6264 1.3976 13.5116 0.0074 0.0461 21.7673 0.0135 3.4688 14.4035 6.5761 1.3958 15.9126 5.4562 3.3404 13.3513 3.8972 12.7449 7.0888 0.4861 0.1408 3.2723 7.1685 0.0002 68.1195 30.8331 2.2616 1.4439 3.1904 3.4785 5.0356 1.4091 3.2711 17.3455 6.2128 2.7050 24.8300 7.4758 0.1914 7.7324 1.1937 1.7957 0.1663 22.3236 16.6613 23.3609 1.5193 6.5398 24.9313 19.4065 39.3840 1.4836
temp: 298.150 k
press: 1.00000 atm
elementType: 17 6 6 6 6 6 6 6 6 6 6 6 6 6 6 6 6 6 6 6 6 1 1 1 1 1 1 1 1 1 1 1
symmnumber: 1
zpe: 631240.6 jmol-1
zpe.correction: 0.240427 hartree
zpe.thermalcorrener: 0.254905 hartree
zpe.thermalcorrenthalpy: 0.255850 hartree
zpe.thermalcorrgfe: 0.198699 hartree
zpe.sumelectzpe: -1227.472729 hartree
zpe.sumelectthermal: -1227.458250 hartree
zpe.sumelectthermalent: -1227.457306 hartree
zpe.sumelectthermalfe: -1227.514457 hartree
dipole: -2.3739 0.0975 0.0000
dipole: 2.3759
quadrupole: -120.3928 -105.3776 -135.4209
quadrupole: 1.1607 0.0001 0.0002
quadrupole: 0.0043 15.0195 -15.0238 1.1607 0.0001 0.0002
hfenergy: -1227.7131558 hartree
pointgroup: C01 [X(C20H11Cl1)]
dipole: -0.9311381 -0.0820254 -0.0000074 debye
polarizability: 409.138383|-3.8547659|278.6174015|0.0006836|0.0007663|81.5008125 unknown
InChI: InChI=1S/C20H11Cl/c21-18-11-10-16-14-7-2-5-12-4-1-6-13(19(12)14)15-8-3-9-17(18)20(15)16/h1-11H
charge 0 multiplicity 1
32 atoms
Cl 5.243083 0.826773 0.00008
C  1.191525 -0.155617 -0.000006
C  -1.702085 0.074583 -0.000007
C  0.579525 1.154334 0.000037
C  0.382861 -1.354681 -0.000048
C  -0.896253 1.27303 -0.000041
C  -1.095081 -1.235942 0.000026
C  2.640909 -0.282611 -0.000006
C  -3.147668 0.189499 -0.000007
C  1.417194 2.288772 0.000153
C  1.027901 -2.609331 -0.000159
C  -1.54737 2.525351 -0.000147
C  -1.936324 -2.369281 0.000127
C  3.417847 0.920545 0.000081
C  3.243363 -1.579392 -0.000091
C  -3.756694 1.48502 -0.000084
C  -3.953871 -0.99334 0.000069
C  2.830568 2.182288 0.000175
C  2.441492 -2.722035 -0.000181
C  -2.963194 2.634119 -0.000168
C  -3.351691 -2.253195 0.000149
H  0.990726 3.294717 0.000241
H  0.439578 -3.530409 -0.000241
H  -0.964223 3.450179 -0.000229
H  -1.506645 -3.374584 0.0002
H  4.334014 -1.657509 -0.000087
H  -4.850383 1.557556 -0.000082
H  -5.045289 -0.892145 0.000068
H  3.452584 3.081638 0.000264
H  2.902888 -3.715168 -0.000267
H  -3.426442 3.626487 -0.000248
H  -3.965744 -3.160051 0.000226
