program: Gaussian 09
title: 000181847
version: EM64L-G09RevD.01
frameworkgroup: C1[X(C20H16NO4)]
method: RPBEPBE
basis: SDD
operation: Freq
keyword: #p
keyword: freq=noraman
keyword: PBEPBE/SDD
title: #p freq=noraman PBEPBE/SDD
converged: YES YES NO NO
title: Mulliken charges:
elementType: O O O O N C C C C C C C C C C C C C C C C C C C C H H H H H H H H H H H H H H H H
charge: -0.243999 -0.234610 -0.240206 -0.426118 -0.145442 0.093443 0.275163 0.270277 0.312431 0.444153 0.450563 -0.403321 -0.401942 -0.416136 -0.490836 -0.542808 0.144758 0.189342 -0.483427 -0.648731 -0.560542 0.217101 0.186405 -0.201909 -0.481487 0.242728 0.275809 0.270095 0.264575 0.285189 0.269035 0.296660 0.264532 0.260642 0.239958 0.263932 0.264314 0.387239 0.251344 0.251743 0.250084
chargesum: 1.00000
title: Mulliken charges with hydrogens summed into heavy atoms:
elementType: O O O O N C C C C C C C C C C C C C C C C C C C C
charge: -0.243999 -0.234610 -0.240206 -0.038879 -0.145442 0.093443 0.275163 0.270277 0.312431 0.444153 0.450563 -0.160593 -0.126133 -0.146041 -0.226262 -0.257618 0.144758 0.189342 -0.214393 0.173102 -0.320585 0.217101 0.186405 0.326338 0.271684
polarizability: 5.67512862e+02 -5.79495666e+00 2.44834455e+02 1.79863332e+00 7.03811633e+00 1.05793614e+02
1716.lowfreq: -2.9871 -0.0010 -0.0008 -0.0007 2.6091 7.7369 28.8071 38.9534 62.2409
frequency: 28.8055 38.9452 62.2366 75.1350 77.5218 105.0727 117.7756 145.3991 168.6153 186.3090 198.1083 212.5534 242.2279 261.8550 270.5412 289.1391 313.5950 326.6418 337.6851 348.0692 356.2852 384.3817 402.2961 418.2248 424.6537 434.8056 445.7075 482.8205 500.5686 524.3760 549.2690 579.2629 587.8598 628.0208 658.6721 662.6521 678.3902 682.7828 698.6574 710.2838 731.1615 736.4617 753.5442 776.6228 795.0706 801.3241 825.1640 827.7560 833.9852 862.6389 883.9474 890.9015 896.3472 904.1297 951.3327 964.6396 972.3915 978.9676 1016.6585 1060.5926 1069.8803 1094.5330 1106.4291 1108.6479 1114.4562 1121.3537 1137.7315 1148.5578 1191.8380 1205.9060 1211.0382 1237.2020 1250.0980 1258.4784 1285.8295 1289.8627 1318.1004 1335.3455 1359.7098 1370.0226 1383.8488 1403.7162 1414.5717 1429.0850 1439.6345 1451.6781 1454.6709 1461.2956 1462.1520 1469.9831 1482.3338 1486.9159 1494.8512 1504.8348 1529.5408 1537.9793 1569.1414 1604.6901 1623.4117 1627.5147 1634.9478 3019.8973 3023.4839 3044.0364 3117.5986 3126.2907 3133.4603 3141.8990 3150.9180 3151.0054 3157.5619 3168.9723 3180.8941 3181.9950 3192.7996 3228.2285 3576.2735
redmass: 4.6798 4.2165 3.8345 3.0150 3.8688 5.8827 5.1749 4.4297 2.3255 3.3438 1.8761 4.7235 4.1646 2.6053 1.5249 4.8040 5.2042 5.1286 4.6346 5.7709 3.9401 1.2576 3.2022 4.4014 4.4144 7.0435 3.6040 3.5393 5.6884 5.8904 4.3970 5.6814 4.7418 6.8259 6.0036 5.2998 7.6555 7.3595 7.9508 4.5784 4.6982 2.9268 6.4173 3.7023 5.9482 5.6436 1.5066 1.5896 8.4848 1.5348 1.5983 1.5762 3.9164 1.6297 5.8341 4.8794 4.1041 1.4997 3.6583 1.4510 4.1198 2.0275 1.2378 1.7207 1.3753 1.0372 2.4266 1.3197 1.9122 1.7180 1.4292 1.9156 1.6083 2.6828 5.8075 1.5341 3.3041 2.5832 1.5318 2.8057 2.7132 2.9323 6.3517 1.9576 1.2314 3.2426 1.2851 1.3161 1.2854 1.8716 1.2614 1.2454 1.2296 3.6226 5.6001 4.2068 5.7751 7.5519 7.6697 6.3757 7.7784 1.0351 1.0281 1.0539 1.1030 1.0921 1.1197 1.1063 1.0904 1.1019 1.1067 1.0937 1.0943 1.0953 1.0907 1.0906 1.0664
irintensity: 1.1713 0.8357 3.4995 13.8270 5.5940 3.4003 0.6632 1.1504 0.3267 1.0024 0.2183 0.8676 4.6014 0.5444 1.1428 7.6363 1.8160 7.1539 0.1109 10.0880 17.9711 129.6574 7.4616 10.1556 2.5045 9.3559 12.3748 5.9574 3.5821 4.9347 7.8108 2.3110 1.9686 9.5049 3.1611 9.3305 4.7266 1.5036 4.1954 0.2399 2.1101 12.9175 7.9931 2.0306 1.1690 23.6334 0.6323 15.8700 37.4523 18.5958 20.9012 64.1171 19.8475 36.8421 51.3858 150.8345 116.0291 6.1879 18.3818 4.6014 11.2130 225.2151 0.0246 46.1969 19.6076 0.0314 21.2300 3.7653 168.6366 106.7591 88.2072 68.1149 296.8429 16.4231 117.9456 130.3323 137.9944 259.5829 2.0061 37.1684 19.5186 24.9547 105.7349 11.2382 12.0500 9.6986 45.9905 17.8898 18.8905 259.0019 39.1152 139.9121 61.6961 180.6825 458.4460 27.6960 10.5734 35.1814 9.8255 179.6971 31.6494 15.9661 48.6236 93.7014 8.8690 9.5772 12.3317 17.3422 2.3467 0.8763 12.6451 0.9826 1.4618 2.0298 1.0389 3.1447 132.9098
temp: 298.150 k
press: 1.00000 atm
elementType: 8 8 8 8 7 6 6 6 6 6 6 6 6 6 6 6 6 6 6 6 6 6 6 6 6 1 1 1 1 1 1 1 1 1 1 1 1 1 1 1 1
symmnumber: 1
zpe: 827558.5 jmol-1
zpe.correction: 0.315200 hartree
zpe.thermalcorrener: 0.335794 hartree
zpe.thermalcorrenthalpy: 0.336738 hartree
zpe.thermalcorrgfe: 0.266107 hartree
zpe.sumelectzpe: -1125.397788 hartree
zpe.sumelectthermal: -1125.377194 hartree
zpe.sumelectthermalent: -1125.376250 hartree
zpe.sumelectthermalfe: -1125.446881 hartree
dipole: 3.4097 5.0119 -0.2683
dipole: 6.0677
quadrupole: -33.7142 -105.2910 -143.6601
quadrupole: 7.0884 1.4753 -1.3659
quadrupole: 60.5075 -11.0692 -49.4383 7.0884 1.4753 -1.3659
hfenergy: -1125.712988 hartree
pointgroup: C01 [X(C20H16N1O4)]
dipole: -1.4001266 1.9332837 -0.0297887 debye
polarizability: 566.1487125|16.0421696|244.6095509|18.2661768|-12.4199017|107.3826681 unknown
InChI: InChI=1S/C20H16NO4/c1-21-9-12-5-16(22)17(23-2)7-14(12)13-4-3-11-6-18-19(25-10-24-18)8-15(11)20(13)21/h3-9,22H,10H2,1-2H3
charge 1 multiplicity 1
41 atoms
O  5.4593 1.253747 -0.630416
O  6.026259 -0.991653 -0.002498
O  -5.13978 -1.868882 -0.400457
O  -5.941696 0.910327 -0.743113
N  0.091443 1.808742 0.145876
C  0.533114 0.45277 0.116371
C  -0.482777 -0.567609 0.144868
C  1.94261 0.094299 0.067921
C  -1.885111 -0.225794 -0.050128
C  2.292867 -1.290347 0.348495
C  -2.233836 1.167561 -0.203785
C  -0.079793 -1.925024 0.372874
C  -1.220696 2.131182 -0.043125
C  2.999796 1.000173 -0.310728
C  1.252968 -2.261715 0.53108
C  3.661015 -1.727442 0.373577
C  4.304102 0.535307 -0.290911
C  4.641446 -0.801166 0.069675
C  -2.928444 -1.177649 -0.121115
C  0.971058 2.945153 0.573447
C  -3.592652 1.55196 -0.434062
C  -4.271159 -0.810234 -0.353295
C  -4.603311 0.596553 -0.515728
C  6.602276 0.305721 -0.461986
C  -6.602669 -1.767789 -0.653579
H  -0.838559 -2.706342 0.44804
H  -1.460993 3.197303 -0.022528
H  2.814177 2.007389 -0.676775
H  1.534844 -3.297002 0.748663
H  3.904034 -2.769067 0.596339
H  -2.744058 -2.248616 -0.018996
H  1.774842 2.572276 1.22124
H  1.401463 3.468913 -0.295123
H  0.360039 3.654595 1.152013
H  -3.836617 2.615888 -0.546482
H  7.278359 0.694385 0.315579
H  7.090235 0.155973 -1.437993
H  -6.087101 1.883812 -0.84878
H  -7.090674 -1.173089 0.132882
H  -6.937882 -2.813734 -0.621902
H  -6.793837 -1.322579 -1.641539
