program: Gaussian 09
title: 000181845
version: EM64L-G09RevD.01
frameworkgroup: C1[X(C16H20BrN3O2)]
method: RPBEPBE
basis: SDD
operation: Freq
keyword: #p
keyword: freq=noraman
keyword: PBEPBE/SDD
title: #p freq=noraman PBEPBE/SDD
converged: YES YES NO NO
title: Mulliken charges:
elementType: Br O O N N N C C C C C C C C C C C C C C C C H H H H H H H H H H H H H H H H H H H H
charge: 0.001940 -0.269578 -0.245968 -0.161722 -0.229000 -0.084485 -0.014712 -0.445486 -0.406835 -0.697036 -0.690610 0.284359 -0.278544 -0.157793 -0.222420 0.366052 -0.321362 -0.332445 -0.371122 -0.172675 -0.152946 -0.232689 0.206028 0.249156 0.241722 0.228702 0.234633 0.217355 0.265988 0.215022 0.221167 0.215445 0.271096 0.221510 0.214575 0.282034 0.278870 0.257944 0.255796 0.257291 0.248683 0.252062
chargesum: 0.00000
title: Mulliken charges with hydrogens summed into heavy atoms:
elementType: Br O O N N N C C C C C C C C C C C C C C C C
charge: 0.001940 -0.269578 -0.245968 -0.161722 -0.229000 -0.084485 0.191316 0.045392 0.056500 0.001329 0.017098 0.284359 0.157541 0.124241 0.056450 0.366052 -0.063418 -0.076648 -0.113832 0.076008 0.099116 -0.232689
polarizability: 2.63762829e+02 1.52607315e+01 2.14579356e+02 2.45341117e+01 1.27853507e+01 1.58492327e+02
1716.lowfreq: -4.0941 -1.3752 -0.0007 0.0002 0.0005 2.8278 9.6668 17.7908 27.4831
frequency: 9.6405 17.7692 27.4632 43.9544 54.7967 56.6710 78.8774 106.2600 115.7239 123.1229 150.9344 169.7584 195.6816 202.2515 211.2417 217.4703 220.9324 243.8844 258.2086 302.4333 309.4378 329.4191 332.2718 397.0483 408.6843 413.8531 469.5135 488.1547 501.6385 502.2416 539.2293 613.3818 618.3476 622.5051 642.1694 654.5137 698.5400 712.0125 741.3953 779.6295 787.0617 797.1508 800.5619 820.5590 826.3962 856.9130 874.9660 877.9038 898.9459 926.7194 934.1595 943.3909 957.3949 981.1530 984.5548 987.1270 999.4037 1037.5412 1059.1105 1074.1427 1101.0930 1101.5351 1111.5542 1115.2700 1137.6168 1141.1873 1177.4543 1180.1945 1199.2440 1203.4123 1219.4476 1227.7424 1245.7252 1255.4877 1283.9910 1291.3913 1307.1216 1316.3728 1333.2771 1340.4831 1363.7057 1366.7272 1378.1474 1390.8017 1393.0895 1401.8737 1413.5872 1428.1629 1458.5505 1465.7223 1468.6628 1475.0957 1478.2301 1480.6056 1481.8338 1490.0147 1501.5651 1580.0447 1600.4940 1620.3514 2952.8396 2991.4292 2993.3832 3000.8998 3004.9119 3011.5317 3014.9659 3068.6896 3081.3058 3086.7969 3100.5847 3110.1790 3118.1591 3154.7834 3158.1803 3173.9259 3178.7819 3233.8498 3238.2089 3264.5812
redmass: 6.8135 6.9218 3.7444 6.5542 4.8641 4.6132 4.4808 3.3816 5.6337 6.2285 2.6111 3.4014 2.7389 4.4686 1.2329 3.6334 4.0630 1.2233 4.0771 4.6299 6.6480 4.1672 2.2436 4.5153 3.2750 2.9756 4.5470 3.3980 2.6850 2.7178 3.9414 3.2941 6.6031 7.1540 4.3597 4.4386 3.4194 7.5074 1.2665 1.5591 2.5900 3.4954 1.3543 1.3371 1.5492 1.4120 3.0121 3.1915 2.3677 1.1727 1.3448 1.4565 1.3474 4.1531 4.1468 4.4007 2.4516 1.6764 2.4354 2.2407 1.8791 2.3970 1.3309 2.3246 2.3725 2.3304 1.2102 1.7309 1.7825 2.4121 3.0049 1.6166 3.7547 1.6292 1.1423 1.2607 1.8251 1.3763 1.4049 2.7167 3.1775 1.4985 1.2062 1.3638 1.4066 3.6154 1.7041 2.8402 1.0569 1.2742 1.5792 1.0752 4.3145 1.1213 1.0696 1.1190 1.0636 7.3045 6.5217 8.4467 1.0555 1.0365 1.0427 1.0694 1.0739 1.0982 1.0701 1.1030 1.0995 1.0992 1.0960 1.1000 1.0995 1.0880 1.0884 1.0967 1.0977 1.0920 1.0974 1.1093
irintensity: 0.6153 0.1617 0.5751 0.5052 0.1592 0.5445 2.8981 0.3035 2.7465 0.5016 4.6549 0.9385 0.4974 3.0395 0.5294 7.2074 2.5180 0.5437 0.7958 1.8662 3.5138 0.5901 0.8705 4.2147 0.5130 0.0193 2.9164 3.5195 3.6347 22.6177 5.6627 13.4874 38.4825 15.7643 7.0187 6.9004 0.2024 31.7572 14.3923 84.4148 5.3496 6.6718 20.8211 14.9264 53.3393 1.5296 36.3571 3.1481 1.6687 6.7243 0.0449 0.1434 0.3584 37.1599 12.7945 73.2621 36.7650 50.7718 28.4773 59.1585 12.1284 5.5519 9.6566 46.0965 16.0939 12.2207 74.5827 9.9206 44.4608 56.7996 275.2207 82.9288 10.5497 87.6484 4.7563 1.4493 139.6820 4.3148 9.0169 90.8998 4.5940 10.8136 24.7095 62.0267 30.2736 1.8082 99.4113 14.5804 4.1484 103.1910 138.1680 34.8351 1.0142 4.1937 3.5187 5.2469 10.0507 12.0064 27.2105 255.1650 36.8741 31.9825 13.1450 15.9589 16.8156 18.9266 54.5973 29.9168 25.5982 49.1403 16.1823 7.6512 12.8219 9.0962 2.0317 9.2460 1.5199 3.9708 0.8603 1.6380
temp: 298.150 k
press: 1.00000 atm
elementType: 35 8 8 7 7 7 6 6 6 6 6 6 6 6 6 6 6 6 6 6 6 6 1 1 1 1 1 1 1 1 1 1 1 1 1 1 1 1 1 1 1 1
symmnumber: 1
zpe: 882072.9 jmol-1
zpe.correction: 0.335964 hartree
zpe.thermalcorrener: 0.358093 hartree
zpe.thermalcorrenthalpy: 0.359038 hartree
zpe.thermalcorrgfe: 0.280317 hartree
zpe.sumelectzpe: -948.204623 hartree
zpe.sumelectthermal: -948.182494 hartree
zpe.sumelectthermalent: -948.181549 hartree
zpe.sumelectthermalfe: -948.260270 hartree
dipole: -1.9617 -4.1328 -1.6979
dipole: 4.8797
quadrupole: -155.0149 -141.1757 -147.6670
quadrupole: 19.7948 4.8360 8.3506
quadrupole: -7.0623 6.7768 0.2855 19.7948 4.8360 8.3506
hfenergy: -948.540587 hartree
pointgroup: C01 [X(C16H20Br1N3O2)]
dipole: -0.6091838 1.6752677 0.7127957 debye
polarizability: 258.1583793|-17.707244|216.9524412|-29.4102167|15.9032314|161.7236916 unknown
InChI: InChI=1S/C16H20BrN3O2/c1-13(2)20(16(21)19-10-8-18-12-19)9-3-11-22-15-6-4-14(17)5-7-15/h4-8,10,12-13H,3,9,11H2,1-2H3
charge 0 multiplicity 1
42 atoms
Br 6.921714 -1.078463 -1.127177
O  1.685623 1.302351 1.125169
O  -2.755613 -0.065464 -2.029673
N  -2.601238 0.974521 0.06877
N  -2.668625 -1.426749 -0.117478
N  -3.28862 -3.199256 1.164062
C  -2.866592 2.343109 -0.512712
C  -2.092354 0.944969 1.468706
C  -0.657301 1.505428 1.620373
C  -4.294916 2.428555 -1.095938
C  -1.793199 2.78475 -1.536278
C  -2.671808 -0.121161 -0.770953
C  0.389316 0.635427 0.918962
C  -2.016109 -2.557112 -0.645907
C  -3.440764 -1.880773 0.970672
C  2.827666 0.693419 0.580776
C  -2.390851 -3.626229 0.162513
C  2.821442 -0.528387 -0.136718
C  4.044703 1.387945 0.792485
C  4.035822 -1.050437 -0.641049
C  5.253257 0.868364 0.290354
C  5.236932 -0.350295 -0.424414
H  -2.813918 3.022848 0.360089
H  -2.114266 -0.088505 1.84627
H  -2.780687 1.538922 2.099023
H  -0.591051 2.53883 1.235085
H  -0.419059 1.55186 2.699835
H  -4.504087 3.468556 -1.404659
H  -4.398793 1.777806 -1.979176
H  -5.049165 2.134042 -0.344314
H  -0.777577 2.755208 -1.103235
H  -1.995872 3.824033 -1.853373
H  -1.818936 2.133829 -2.424108
H  0.183337 0.552178 -0.167944
H  0.41499 -0.384561 1.35616
H  -1.396222 -2.486229 -1.534698
H  -4.107607 -1.232384 1.533339
H  -2.085157 -4.667026 0.091312
H  1.895988 -1.084309 -0.311473
H  4.02726 2.328999 1.349901
H  4.034413 -1.993397 -1.195166
H  6.191823 1.405286 0.453985
