program: Gaussian 09
title: 000181907
version: EM64L-G09RevD.01
frameworkgroup: C1[X(C24H27NO4)]
method: RPBEPBE
basis: SDD
operation: Freq
keyword: #p
keyword: freq=noraman
keyword: PBEPBE/SDD
title: #p freq=noraman PBEPBE/SDD
converged: YES YES NO NO
title: Mulliken charges:
elementType: O O O O N C C C C C C C C C C C C C C C C C C C C C C C C H H H H H H H H H H H H H H H H H H H H H H H H H H H
charge: -0.295508 -0.277232 -0.206719 -0.237660 -0.315527 -0.426146 -0.365744 -0.034550 -0.260434 0.044344 0.336221 0.344067 0.347424 -0.708380 -0.687372 -0.484486 -0.576440 -0.852314 -0.798308 -0.021281 0.226165 0.191449 0.189600 -0.388803 0.128426 -0.353370 -0.365229 -0.245974 -0.204768 0.214963 0.192787 0.194048 0.232315 0.202854 0.205248 0.243007 0.234611 0.240206 0.209138 0.199238 0.214366 0.200086 0.228256 0.255854 0.281613 0.232018 0.275456 0.225482 0.224417 0.244288 0.231253 0.295368 0.282080 0.263378 0.238335 0.237883
chargesum: 0.00000
title: Mulliken charges with hydrogens summed into heavy atoms:
elementType: O O O O N C C C C C C C C C C C C C C C C C C C C C C C C
charge: -0.295508 -0.277232 -0.206719 -0.237660 -0.080915 -0.018397 0.060620 0.168305 0.187822 0.044344 0.336221 0.344067 0.347424 -0.059798 -0.044664 -0.228632 -0.294827 -0.119358 -0.098350 -0.021281 0.226165 0.191449 0.189600 -0.093435 0.128426 -0.071289 -0.101851 -0.007639 0.033114
polarizability: 4.23411628e+02 -1.68561031e+01 3.23815518e+02 -2.67197838e+01 -4.19219385e+00 1.74107344e+02
1716.lowfreq: -0.0008 -0.0005 0.0004 2.3043 4.0691 7.4918 14.5294 16.6591 23.3018
frequency: 14.2416 16.2526 23.2401 25.2809 38.6671 44.0878 53.4999 64.5258 90.9659 96.1119 112.1260 132.8378 141.2744 152.3111 158.5668 171.2908 172.8485 191.5805 198.1382 206.8261 213.1737 230.7385 244.2899 257.7493 266.0914 278.6949 283.7587 292.9025 315.0131 333.3262 359.4919 373.9594 418.4087 430.4239 444.3071 456.9115 474.1134 476.9482 495.9300 500.3946 510.2710 521.9370 525.7522 537.9684 560.4078 574.2779 589.5674 628.3986 661.4210 666.9248 695.0357 715.1889 751.5275 760.6367 765.2839 781.6591 786.6056 813.9192 828.2783 831.7376 875.3113 885.3296 894.9755 897.9489 905.1217 908.0546 909.4995 925.6320 931.5546 936.8586 956.0102 973.9578 974.9765 1003.4369 1003.4417 1012.3026 1026.6421 1036.2721 1045.2444 1050.1057 1053.2243 1072.6872 1096.1700 1106.9607 1111.1618 1127.8140 1130.0701 1155.3096 1161.6550 1171.1544 1178.6834 1193.6791 1199.5255 1226.5983 1239.0466 1242.7840 1261.5755 1275.0890 1282.5038 1309.0109 1317.8498 1323.5735 1333.2891 1351.8346 1362.0479 1369.0912 1378.0655 1382.4106 1389.5103 1399.2008 1399.9418 1400.3107 1417.0375 1430.9226 1437.3724 1446.1295 1453.0264 1459.3568 1460.2859 1462.9865 1464.2412 1467.1450 1474.7393 1482.2620 1483.5496 1485.4917 1489.4351 1494.5265 1525.5515 1551.7490 1569.7892 1583.4584 1607.8752 1615.1327 1619.6976 2890.5068 2967.2898 2971.9781 2975.0061 2976.0813 2976.5702 2986.8811 2991.7719 3032.4659 3048.8549 3055.6154 3060.6713 3065.8778 3070.6901 3071.3665 3072.8272 3090.0696 3091.9938 3095.6528 3140.5901 3148.0166 3152.7654 3165.4646 3165.7680 3176.4383 3190.3055 3408.4037
redmass: 4.8579 4.7111 6.2043 3.9082 4.6229 2.6662 5.1859 4.1035 4.2231 3.8541 1.0579 5.5593 3.2477 4.0660 4.8216 4.2158 1.4916 2.4576 2.1528 1.3177 1.8987 3.1398 2.1096 1.3634 4.9274 5.0191 3.0229 4.5009 3.5648 3.6751 3.7006 3.2512 3.8546 3.3191 3.7080 2.2272 4.9618 3.9993 4.2252 3.5778 5.1917 5.4535 3.8308 4.5004 5.0108 4.7289 6.4002 5.6073 1.6370 3.3779 3.7695 4.6417 5.0546 2.7074 4.7329 2.5992 1.7438 2.0709 2.1838 5.8070 3.0472 1.4055 2.4972 1.5683 1.5953 1.8796 1.4884 1.6282 2.4077 1.4258 3.1358 2.5770 1.3700 1.3797 1.5954 2.2673 2.0358 1.7235 1.6126 1.5459 1.8953 3.5552 2.0363 2.3040 2.3796 1.7339 2.0841 1.8437 1.3300 2.4116 3.0816 2.2625 1.1926 2.0985 1.6272 1.7497 1.4091 1.7632 1.1359 1.4354 3.9926 1.3151 4.5350 1.3861 1.4705 1.2870 5.2022 1.4023 1.2281 1.9592 2.6887 1.2651 3.1309 1.8691 1.1271 2.6194 1.1265 1.0501 2.6634 1.0539 1.0550 1.0905 1.1339 1.0860 1.0583 1.3863 1.0865 1.0698 11.2351 10.8864 7.1896 7.9425 5.9285 7.6572 7.2227 1.0709 1.0364 1.0675 1.0401 1.0559 1.0570 1.0368 1.0637 1.0894 1.0981 1.0943 1.0988 1.0969 1.0979 1.1008 1.0995 1.1000 1.0998 1.1003 1.0862 1.0918 1.0901 1.0931 1.0935 1.1003 1.0921 1.0736
irintensity: 1.1820 0.4436 0.0327 0.3993 0.5019 0.0392 0.9756 0.5212 0.1264 1.7897 0.2195 3.7189 0.9974 1.5464 0.2810 6.1418 3.0421 7.0201 4.4310 1.2847 7.0841 0.1814 1.3306 0.7818 1.1215 5.5188 3.1374 6.6387 4.7776 6.6644 3.1779 7.3980 3.4876 2.1637 0.6229 3.9684 6.7069 8.3512 0.7752 2.0949 3.8395 8.3292 10.8202 6.9192 3.3704 3.5350 7.8281 4.6257 114.1173 3.9891 13.9693 1.2277 13.1415 33.9144 59.3225 47.3456 37.3608 2.7346 8.8535 43.2711 7.7921 0.3827 6.5760 10.9885 15.4008 24.4163 9.7967 21.6443 69.6491 1.3910 8.7972 17.1219 2.1827 2.3802 17.3024 4.1507 15.6159 8.1038 7.0223 4.8586 18.9418 7.2785 6.8190 30.1964 16.9565 129.1270 49.7686 14.6628 26.3311 263.0929 194.2628 25.7573 1.5650 36.6101 2.1930 1.4984 2.9020 5.1542 0.9543 3.4454 394.5285 30.8549 147.4730 7.1875 5.0047 25.9238 8.1763 4.3393 32.7157 14.9104 4.7949 13.8451 59.9956 19.1684 25.3106 71.1430 10.8353 11.5451 0.2167 0.6548 4.3068 14.8530 28.5576 4.9420 7.2333 26.7431 20.7601 41.8209 188.2478 277.9865 7.2983 24.0834 37.3590 115.0257 41.1994 113.4372 31.4963 11.4033 2.3687 35.5344 39.2457 23.3952 83.7337 18.0701 24.6482 17.1368 7.5815 17.8259 77.5286 43.1991 34.9970 50.4318 5.0700 17.4019 3.2721 3.6783 4.0504 11.2940 3.2516 15.8789 2.9166 2.3767
temp: 298.150 k
press: 1.00000 atm
elementType: 8 8 8 8 7 6 6 6 6 6 6 6 6 6 6 6 6 6 6 6 6 6 6 6 6 6 6 6 6 1 1 1 1 1 1 1 1 1 1 1 1 1 1 1 1 1 1 1 1 1 1 1 1 1 1 1
symmnumber: 1
zpe: 1192881.9 jmol-1
zpe.correction: 0.454345 hartree
zpe.thermalcorrener: 0.483244 hartree
zpe.thermalcorrenthalpy: 0.484188 hartree
zpe.thermalcorrgfe: 0.391491 hartree
zpe.sumelectzpe: -1284.260730 hartree
zpe.sumelectthermal: -1284.231831 hartree
zpe.sumelectthermalent: -1284.230887 hartree
zpe.sumelectthermalfe: -1284.323584 hartree
dipole: 8.2373 4.8854 -0.4146
dipole: 9.5861
quadrupole: -183.0435 -162.9442 -172.7944
quadrupole: -22.1502 14.7388 -2.3687
quadrupole: -10.1162 9.9831 0.1330 -22.1502 14.7388 -2.3687
hfenergy: -1284.7150752 hartree
pointgroup: C01 [X(C24H27N1O4)]
dipole: -3.213893 -1.9713037 -0.0931338 debye
polarizability: 424.1348276|-14.7090398|323.4979729|25.8035182|0.565952|173.7016901 unknown
InChI: InChI=1S/C24H27NO4/c1-15(2)25-10-7-11-28-24-16(3)12-18(13-17(24)4)23(27)22-14-20(26)19-8-5-6-9-21(19)29-22/h5-6,8-9,12-15,25H,7,10-11H2,1-4H3
charge 0 multiplicity 1
56 atoms
O  -3.614974 1.37576 -0.301774
O  2.688108 -0.160731 -0.472242
O  2.477992 3.383341 -0.204849
O  6.511384 0.481742 1.118222
N  -5.802233 -1.376413 0.622682
C  -5.868195 1.117857 0.549225
C  -6.131762 -0.199988 -0.213036
C  -5.667464 -2.681212 -0.081037
C  -4.404308 1.283744 0.95982
C  -2.216385 1.521281 -0.196619
C  -1.385603 0.475906 0.302859
C  -1.669792 2.738427 -0.710434
C  0.585587 1.888995 -0.180617
C  -5.123227 -3.727921 0.912805
C  -6.975892 -3.179978 -0.755385
C  0.012452 0.680257 0.295179
C  -0.274551 2.906805 -0.679727
C  -1.95508 -0.844572 0.78984
C  -2.585563 3.806783 -1.272995
C  2.042334 2.189911 -0.136514
C  3.079316 1.096076 0.00836
C  4.921947 -1.04898 0.104991
C  3.618548 -1.221888 -0.430201
C  4.332741 1.330397 0.523615
C  5.352322 0.278976 0.627585
C  5.79505 -2.168711 0.117419
C  3.176474 -2.458568 -0.947675
C  5.372774 -3.409169 -0.388707
C  4.06175 -3.551824 -0.923067
H  -6.172285 1.972007 -0.08524
H  -6.489496 1.153599 1.467968
H  -7.18564 -0.191919 -0.580813
H  -5.478486 -0.22588 -1.105183
H  -4.909177 -2.525251 -0.876333
H  -4.247232 2.214254 1.540934
H  -4.079572 0.410723 1.552249
H  -6.436972 -1.459632 1.431782
H  -4.170946 -3.382773 1.352022
H  -4.954815 -4.699288 0.413881
H  -5.842612 -3.895017 1.738757
H  -6.798162 -4.114165 -1.320471
H  -7.751806 -3.386997 0.007573
H  -7.377558 -2.43016 -1.461063
H  0.657013 -0.120675 0.667383
H  0.178368 3.837837 -1.036995
H  -2.143127 -0.83173 1.881061
H  -2.91382 -1.083854 0.2996
H  -1.242777 -1.664873 0.592647
H  -2.010322 4.69963 -1.570023
H  -3.135894 3.433004 -2.155348
H  -3.350362 4.111666 -0.53588
H  4.574776 2.342387 0.856504
H  6.797866 -2.020712 0.53177
H  2.16598 -2.540054 -1.358491
H  6.05115 -4.268288 -0.376377
H  3.735963 -4.518743 -1.320939
