program: Gaussian 09
title: 000181805
version: EM64L-G09RevD.01
frameworkgroup: C1[X(C6H8O4)]
method: RPBEPBE
basis: SDD
operation: Freq
keyword: #p
keyword: freq=noraman
keyword: PBEPBE/SDD
title: #p freq=noraman PBEPBE/SDD
converged: YES YES NO NO
title: Mulliken charges:
elementType: O O O O C C C C C C H H H H H H H H
charge: -0.228057 -0.195011 -0.405266 -0.233116 -0.028308 -0.453271 -0.551515 -0.512119 0.193477 0.185816 0.266967 0.247946 0.246488 0.272001 0.254937 0.263651 0.292631 0.382749
chargesum: 0.00000
title: Mulliken charges with hydrogens summed into heavy atoms:
elementType: O O O O C C C C C C
charge: -0.228057 -0.195011 -0.022518 -0.233116 0.238659 0.041163 -0.024577 0.044164 0.193477 0.185816
polarizability: 9.40030101e+01 3.96580567e+00 6.63027095e+01 -2.93661251e+00 -2.88950712e+00 5.76095269e+01
1716.lowfreq: -5.4539 -0.0013 -0.0011 -0.0010 2.8586 17.9090 36.2084 62.0846 84.4084
frequency: 35.9517 62.0256 84.3944 143.9937 171.8702 311.4954 316.5891 455.6860 466.0520 502.8073 513.8015 574.7827 631.6997 647.2112 700.1591 768.5265 818.0527 852.1879 876.9930 943.8355 944.8304 1001.9834 1041.0782 1061.5014 1092.7512 1098.8979 1148.9602 1195.8914 1206.5058 1244.5925 1275.0777 1290.3125 1317.5519 1339.8115 1377.7711 1435.7816 1450.9452 1480.3741 1660.3789 1711.7039 3009.5558 3016.8978 3036.7346 3061.0229 3089.9716 3095.9288 3109.4113 3511.4885
redmass: 7.1386 5.3940 5.3272 2.0836 6.4679 10.1646 2.5896 4.9463 3.1583 2.0156 2.5858 4.8291 3.6265 1.5443 4.4075 3.1534 2.6113 2.3537 4.6682 2.0472 3.5219 2.3098 2.4547 2.2377 3.2758 1.8080 1.2279 1.2956 1.5858 1.4645 1.3225 1.5186 1.4314 1.6371 1.7088 1.0887 1.0785 1.0921 8.3317 12.6886 1.0615 1.0657 1.0635 1.0976 1.0902 1.0975 1.1026 1.0640
irintensity: 2.4675 2.0520 4.8848 3.2552 2.5074 0.3792 1.7257 7.5772 21.9335 18.5584 5.6936 37.4524 16.2146 133.7429 3.7008 15.5076 18.0368 32.4971 17.1836 28.1911 71.4838 9.6493 261.0262 46.2449 105.3155 76.4045 8.7206 3.6810 16.5552 7.8913 7.6809 22.3136 3.5294 24.2825 69.9645 37.7024 20.8467 10.5878 218.9089 341.2605 3.9672 8.7132 13.8560 1.0880 16.5360 3.4895 21.8717 26.9939
temp: 298.150 k
press: 1.00000 atm
elementType: 8 8 8 8 6 6 6 6 6 6 1 1 1 1 1 1 1 1
symmnumber: 1
zpe: 359991.2 jmol-1
zpe.correction: 0.137113 hartree
zpe.thermalcorrener: 0.146629 hartree
zpe.thermalcorrenthalpy: 0.147573 hartree
zpe.thermalcorrgfe: 0.100902 hartree
zpe.sumelectzpe: -533.577195 hartree
zpe.sumelectthermal: -533.567679 hartree
zpe.sumelectthermalent: -533.566735 hartree
zpe.sumelectthermalfe: -533.613406 hartree
dipole: 3.6525 1.9686 1.7789
dipole: 4.5145
quadrupole: -66.9354 -61.1206 -57.3284
quadrupole: -11.5466 0.6503 1.4823
quadrupole: -5.1406 0.6742 4.4664 -11.5466 0.6503 1.4823
hfenergy: -533.714308 hartree
pointgroup: C01 [X(C6H8O4)]
dipole: 1.2739708 1.2375351 -0.0116095 debye
dipolederiv: -1.3438267 -0.0241111 0.2927549 0.3322035 -0.5169806 -0.1201648 0.370684 0.0103335 -0.4239309 -1.0728151 -0.185546 0.2724725 -0.2985634 -0.5839238 0.1301655 0.3456747 0.0936785 -0.4478838 -0.9352182 0.0649081 -0.5284186 -0.0055962 -0.3834125 -0.0789569 -0.5170565 -0.0426681 -0.7348512 -0.6621428 -0.1228128 0.1150237 -0.0418896 -0.3979135 0.2473136 -0.1543146 0.1602573 -0.8839094 0.746968 0.0267282 -0.0196624 0.2552518 0.3327371 -0.0624684 0.0030886 0.0089106 0.3291628 -0.010366 0.0874457 0.0393315 0.0126988 -0.0768018 0.0434783 0.0084868 -0.0193944 0.0941472 -0.029006 -0.0568637 0.0851928 -0.0321886 -0.3734227 0.0218436 0.071163 0.0394186 0.0874383 -0.2952879 -0.1182234 0.0229498 -0.214266 -0.0285566 0.135267 0.1078087 0.1195011 -0.1095228 1.7824136 0.1721647 -0.5962569 -0.2066895 0.9862993 0.0221256 -0.6983049 -0.0939553 0.4566454 1.3969019 0.2422707 0.2857544 0.2706547 0.3799974 -0.3033693 0.4233371 -0.2695118 1.3269564 -0.0114984 0.0211271 0.0467273 0.0277523 0.0332186 -0.0378147 0.0507663 -0.0525088 -0.0421977 0.0257243 0.0286131 -0.0643216 0.0215902 0.0853578 0.0027278 -0.0516246 0.0322295 -0.1087071 0.0106704 -0.115787 0.00495 -0.1282059 -0.011487 -0.0129046 -0.0175496 -0.031558 0.073094 -0.0383746 0.0770015 -0.0255235 0.0579139 0.0732486 0.0165684 -0.029959 0.0439895 0.0929344 0.0847422 -0.052245 -0.0389162 -0.0204032 0.0820174 -0.0283143 -0.0092465 -0.0436821 -0.0701396 0.052839 0.0010123 0.0511504 0.0152024 0.071933 -0.0922146 0.0123463 -0.0681144 -0.0001035 0.0625904 0.0359403 -0.0190599 0.0557779 -0.0019205 0.0400218 -0.0339104 0.0226941 0.1115205 0.2356857 -0.0816226 0.0758516 -0.1012431 0.3296097 0.076696 0.1186106 0.0903801 0.2493469 unknown
polarizability: 92.6069094|5.7069602|60.9002876|-5.2165669|-5.658111|64.4080495 unknown
InChI: InChI=1S/C6H8O4/c7-5(8)3-4-1-2-6(9)10-4/h4,7H,1-3H2
charge 0 multiplicity 1
18 atoms
O  -1.26669 -0.980903 -0.159152
O  -3.367789 -0.74591 0.807373
O  3.185344 0.523106 1.013338
O  2.444263 1.021559 -1.131057
C  -0.160752 -0.076469 -0.609884
C  -0.836472 1.307703 -0.815049
C  -2.030841 1.277829 0.162838
C  0.935246 -0.116241 0.469132
C  -2.356107 -0.212804 0.331064
C  2.221587 0.532793 -0.000889
H  0.220001 -0.499854 -1.551838
H  -1.195031 1.392112 -1.854717
H  -0.132016 2.134679 -0.635216
H  -2.922737 1.813481 -0.197254
H  -1.78049 1.690949 1.157921
H  0.606877 0.374523 1.404623
H  1.150912 -1.167182 0.738217
H  4.024892 0.941726 0.678549
