program: Gaussian 09
title: 000181861
version: EM64L-G09RevD.01
frameworkgroup: C1[X(C22H24O9)]
method: RPBEPBE
basis: SDD
operation: Freq
keyword: #pfreq=noraman
keyword: PBEPBE/SDD
title: #p freq=noraman PBEPBE/SDD
converged: NO YES NO NO
title: Mulliken charges:
elementType: O O O O O O O O O C C C C C C C C C C C C C C C C C C C C C C H H H H H H H H H H H H H H H H H H H H H H H H
charge: -0.269130 -0.244543 -0.238703 -0.286081 -0.457274 -0.429398 -0.456941 -0.437249 -0.265955 -0.262609 -0.254945 -0.150231 -0.212472 -0.120115 0.250594 -0.101244 -0.366124 0.353083 -0.126693 0.224599 0.164958 -0.351982 -0.335276 0.400660 -0.378761 -0.504777 -0.440485 -0.512405 -0.386304 0.353002 -0.536668 0.246657 0.248110 0.244536 0.263893 0.255167 0.237007 0.216528 0.226750 0.288132 0.221295 0.233629 0.250302 0.231430 0.319697 0.255613 0.262062 0.362760 0.338613 0.367196 0.249500 0.370255 0.244900 0.223917 0.221522
chargesum: 0.00000
title: Mulliken charges with hydrogens summed into heavy atoms:
elementType: O O O O O O O O O C C C C C C C C C C C C C C C C C C C C C C
charge: -0.269130 -0.244543 -0.238703 -0.286081 -0.094514 -0.090785 -0.089745 -0.066994 -0.265955 -0.015952 -0.006836 0.094305 0.051421 0.135053 0.250594 0.135763 0.077153 0.353083 0.161439 0.224599 0.164958 0.102942 -0.084974 0.400660 -0.147331 -0.185080 -0.184872 -0.250343 -0.136804 0.353002 0.153670
polarizability: 3.39780933e+02 -1.24415130e+01 2.45516463e+02 1.24289922e+01 1.10172958e+01 2.26718643e+02
1716.lowfreq: -22.4457 -7.2834 -1.9494 -0.0008 -0.0005 -0.0004 0.6362 12.5617 18.0070
frequency: -21.6191 12.3419 17.9365 24.0146 44.8673 64.3059 74.8036 91.6917 95.5839 109.7969 128.2258 150.0356 152.5934 169.5886 180.1715 195.3784 217.5263 224.7655 232.1411 238.1451 244.0277 268.5173 274.1176 304.0244 308.8316 320.9071 329.5731 347.0541 371.1206 374.0958 389.8841 402.9531 409.2186 421.6571 433.7572 441.5284 449.1155 468.1231 471.7070 485.6316 491.5954 513.8223 521.3213 549.7578 554.4284 584.2851 589.7316 611.7505 616.6966 623.1159 654.0442 685.3551 704.3683 717.3894 719.0261 726.6029 739.2092 758.0590 778.0124 804.5502 815.2634 837.3284 849.1795 856.0919 870.0574 878.4605 904.8642 912.8351 925.2240 928.0242 939.4681 946.5225 952.4235 963.5321 978.5341 992.3486 1004.8215 1011.6246 1027.1822 1027.8162 1047.3665 1066.7499 1070.1846 1073.6644 1086.0295 1088.1468 1112.2420 1112.4026 1123.4785 1138.2445 1150.2237 1155.9312 1168.7092 1176.3922 1181.9701 1204.0045 1204.9514 1209.3265 1221.5354 1222.2662 1244.6519 1248.9278 1259.3583 1266.1706 1280.8433 1284.1138 1285.8219 1293.9625 1298.1758 1306.7938 1316.5352 1320.5818 1331.0601 1339.6111 1351.0887 1372.6861 1374.7617 1376.0666 1378.7318 1391.1044 1392.1854 1400.8562 1420.2432 1423.1851 1443.3584 1464.5569 1466.6411 1467.3377 1473.0524 1488.6615 1489.2313 1583.8448 1601.1960 1619.7081 1630.0318 2959.8651 2961.3925 2961.5390 2980.4169 2983.9189 2999.3333 3010.3076 3043.9880 3047.6808 3060.0470 3060.4477 3074.8534 3092.5542 3124.6248 3131.9697 3140.3818 3174.0917 3175.4644 3176.5947 3183.6052 3525.6529 3530.9894 3532.6028 3562.4675
redmass: 6.1161 6.6449 5.8779 6.9791 4.1226 5.3443 6.3313 6.4087 5.5164 5.3839 4.0704 5.2716 5.5377 2.9812 3.7457 2.8071 4.1845 4.2736 3.7626 2.2845 3.1003 4.3872 3.7204 3.9664 4.1791 3.9993 1.3496 3.5653 4.3094 4.8971 1.4692 4.0405 1.3360 4.3242 3.7914 3.3243 4.2647 1.3869 3.6242 3.3906 4.5987 4.5992 4.7065 5.3737 3.6497 4.2376 5.1578 4.8469 5.0405 5.1744 4.6339 4.0619 4.7862 3.8611 5.7708 5.1892 5.4701 3.7549 2.8642 1.4165 1.6091 1.8290 4.3851 3.9761 2.1156 2.8761 4.6914 5.0395 4.4343 2.9854 1.4439 3.5719 1.4157 4.3018 3.5519 4.0767 4.6899 3.1115 2.8690 2.1626 3.5760 3.1985 2.5741 3.7008 2.3418 2.2416 1.7494 1.3159 3.1792 1.3565 1.6749 1.3925 1.2392 1.8125 1.2895 1.3209 1.2964 2.0712 1.8599 1.1962 1.9228 1.5038 1.1938 1.4442 1.7405 1.9900 1.3424 1.2257 1.8312 1.3143 1.6115 1.2442 1.2153 1.2155 1.4114 1.4132 1.2541 1.2833 1.4566 4.8810 4.4370 1.8509 3.5772 2.1442 1.7602 1.0911 1.0504 1.1364 1.1316 2.6691 2.5500 8.1606 8.1434 7.1621 8.0735 1.0335 1.0787 1.0829 1.0719 1.0658 1.0846 1.0836 1.0854 1.1039 1.0871 1.0879 1.1003 1.0969 1.0995 1.0902 1.0896 1.0924 1.0946 1.0953 1.0917 1.0653 1.0659 1.0658 1.0657
irintensity: 0.4013 0.1544 0.1573 0.0823 1.4112 0.8710 4.0936 2.3263 6.5455 2.0020 2.3975 5.6232 3.2946 2.8586 4.0667 2.2580 4.2924 7.2502 4.6067 2.8522 11.6407 3.0028 1.7731 5.1854 7.6846 8.5454 65.0992 12.2831 9.5794 32.0126 93.7276 46.2623 92.0623 6.0236 1.0391 5.2611 2.0602 177.6298 8.1794 38.5509 2.6027 12.5037 15.0222 2.9248 8.5701 20.3147 1.8777 22.6633 1.6590 16.4183 33.4679 11.6846 29.2553 12.0559 0.8959 7.2934 2.4316 11.6839 12.7693 26.9228 67.0171 35.8642 102.4699 2.0842 39.3559 184.1100 336.0895 35.8591 111.0113 17.7292 8.9867 67.5228 12.2166 135.6680 112.1447 64.6441 32.4345 7.9401 39.0750 7.8134 62.1480 35.8603 94.0805 34.9422 27.7010 21.3923 116.3274 14.4672 23.1302 32.6884 116.1437 5.6129 7.7921 165.7599 16.5787 48.3436 6.9537 22.0077 37.0332 49.2877 34.0303 34.7405 28.0350 32.5795 10.9143 29.9355 17.5129 32.5447 2.6450 9.6395 21.5862 13.8875 0.7447 6.2866 8.1994 0.3345 45.8818 21.5595 12.8329 18.1112 27.9071 11.9389 19.3522 5.0994 44.8541 16.3610 12.9371 10.1777 82.2333 162.1011 94.9748 52.4663 99.8588 226.0977 113.2272 62.0805 6.9500 21.0954 92.2333 20.2730 23.3424 23.4199 24.4178 46.8314 8.4730 33.3979 32.4909 21.3083 27.0311 11.5758 6.6870 0.0661 6.2609 4.3804 2.3875 33.1230 38.0006 3.4811 22.7513
temp: 298.150 k
press: 1.00000 atm
elementType: 8 8 8 8 8 8 8 8 8 6 6 6 6 6 6 6 6 6 6 6 6 6 6 6 6 6 6 6 6 6 6 1 1 1 1 1 1 1 1 1 1 1 1 1 1 1 1 1 1 1 1 1 1 1 1
symmnumber: 1
zpe: 1127469.8 jmol-1
zpe.correction: 0.429431 hartree
zpe.thermalcorrener: 0.456793 hartree
zpe.thermalcorrenthalpy: 0.457737 hartree
zpe.thermalcorrgfe: 0.370896 hartree
zpe.sumelectzpe: -1527.381907 hartree
zpe.sumelectthermal: -1527.354544 hartree
zpe.sumelectthermalent: -1527.353600 hartree
zpe.sumelectthermalfe: -1527.440442 hartree
dipole: 0.6225 -0.7238 0.5568
dipole: 1.1051
quadrupole: -161.6778 -178.2027 -176.0931
quadrupole: 3.4586 -12.8795 6.8472
quadrupole: 10.3134 -6.2115 -4.1019 3.4586 -12.8795 6.8472
hfenergy: -1527.8113376 hartree
pointgroup: C01 [X(C22H24O9)]
dipole: 0.2488725 -0.3162346 0.1646158 debye
polarizability: 340.0997303|-13.0893145|240.5380227|10.2344656|13.7411038|231.3782856 unknown
InChI: InChI=1S/C22H24O9/c1-27-10-2-4-12-14-9-28-15-7-11(3-5-13(15)21(14)30-16(12)6-10)29-22-20(26)19(25)18(24)17(8-23)31-22/h2-7,14,17-26H,8-9H2,1H3
charge 0 multiplicity 1
55 atoms
O  -3.581202 -0.961061 1.437619
O  3.565169 0.257219 -1.232406
O  -1.13725 -1.198309 -1.748537
O  2.516321 0.61739 0.931021
O  6.629805 2.456882 0.458692
O  7.177069 -0.21837 -0.39932
O  3.936459 3.510516 -0.133889
O  3.347614 -2.653303 -1.002279
O  -6.579366 2.538992 -0.394533
C  -3.246534 -2.098539 -0.717492
C  -2.644751 -1.933073 0.717953
C  5.615746 1.696748 -0.274342
C  5.796074 0.184749 -0.060377
C  4.256458 2.144339 0.277017
C  -4.11902 -0.854817 -0.847821
C  4.736116 -0.601939 -0.868572
C  -2.151825 -2.27213 -1.780884
C  -1.246325 -1.34911 0.720409
C  3.123233 1.241866 -0.255001
C  -4.282991 -0.275682 0.426045
C  -0.594203 -0.956024 -0.476284
C  4.271351 -1.890925 -0.167097
C  -0.58551 -1.088431 1.947689
C  1.270605 -0.034747 0.782552
C  -4.781767 -0.28465 -1.950011
C  0.658805 -0.298089 -0.461973
C  0.660487 -0.442772 1.995357
C  -5.084624 0.852819 0.666048
C  -5.595497 0.853141 -1.758418
C  -5.745391 1.411715 -0.460376
C  -6.762804 3.170561 0.913824
H  -3.880321 -3.008899 -0.753096
H  -2.706021 -2.851733 1.323801
H  5.667714 1.93207 -1.360001
H  5.729392 -0.038718 1.020384
H  4.29822 2.06262 1.382296
H  5.13873 -0.871297 -1.864859
H  -1.632185 -3.24293 -1.643103
H  -2.568655 -2.227029 -2.799624
H  2.376579 1.847921 -0.796617
H  3.825786 -1.647708 0.818373
H  5.14429 -2.549234 -0.014262
H  -1.08189 -1.372027 2.882436
H  -4.672855 -0.707064 -2.955447
H  1.115884 -0.020655 -1.414994
H  1.161818 -0.228432 2.942766
H  -5.171003 1.266694 1.673019
H  7.497923 1.988533 0.340368
H  7.279927 -0.222305 -1.38696
H  4.673717 4.097437 0.174917
H  -6.120369 1.328391 -2.591482
H  2.537681 -2.098539 -1.150911
H  -7.438403 4.019052 0.731164
H  -5.801265 3.539664 1.320845
H  -7.227746 2.472116 1.636773
