program: Gaussian 09
title: 000181769
version: EM64L-G09RevD.01
frameworkgroup: C1[X(C2H8NO3P)]
method: RPBEPBE
basis: SDD
operation: Freq
keyword: #p
keyword: freq=noraman
keyword: PBEPBE/SDD
title: #p freq=noraman PBEPBE/SDD
converged: YES YES NO NO
title: Mulliken charges:
elementType: P O O O N C C H H H H H H H H
charge: 1.196941 -0.691238 -0.683794 -0.643974 -0.533621 -0.397694 -0.645955 0.285231 0.243631 0.253022 0.236980 0.306548 0.301001 0.386621 0.386301
chargesum: 0.00000
title: Mulliken charges with hydrogens summed into heavy atoms:
elementType: P O O O N C C
charge: 1.196941 -0.304617 -0.297493 -0.643974 0.073928 -0.112463 0.087677
polarizability: 7.46495078e+01 -8.61363232e-01 6.36314569e+01 1.95568816e+00 8.26165119e-02 5.48189313e+01
1716.lowfreq: -8.5534 -0.0016 -0.0015 -0.0015 15.5784 18.0667 58.3968 121.2622 135.8400
frequency: 58.3839 121.2441 135.8376 173.5855 242.5743 247.9765 254.2075 331.7747 335.7342 347.0200 372.7986 407.1818 471.8362 550.9207 585.5159 677.9997 709.5658 908.1248 965.3952 970.8226 985.0473 1048.7469 1064.3604 1171.9943 1223.9222 1278.2126 1361.9477 1396.4104 1464.9116 1480.7873 1644.2272 2999.5060 3049.1910 3100.2231 3113.7777 3499.4453 3571.1236 3583.7173 3631.5976
redmass: 3.9138 4.1223 3.3877 1.8090 3.5944 2.2457 1.5615 2.7240 1.6696 1.3383 2.2051 2.2970 2.2900 2.9817 1.6030 6.7806 7.9811 2.4680 2.0959 1.1798 1.2117 1.4529 2.4617 2.0304 1.7434 1.4357 1.3385 1.2053 1.0437 1.0466 1.0971 1.0354 1.0871 1.1006 1.1001 1.0448 1.0660 1.0661 1.1005
irintensity: 0.0912 6.4203 5.1519 8.7645 23.8937 48.0134 8.7158 100.0508 159.5163 10.6273 92.0432 27.1267 7.0853 14.1646 438.4436 88.5968 264.1874 12.5103 3.4367 42.0273 0.1508 15.6771 175.6332 45.9854 29.6144 7.3658 9.1838 25.6836 14.3862 7.7657 59.5532 15.0848 6.3014 18.0611 10.1499 17.3905 28.8759 32.2864 13.5035
temp: 298.150 k
press: 1.00000 atm
elementType: 15 8 8 8 7 6 6 1 1 1 1 1 1 1 1
symmnumber: 1
zpe: 296300.9 jmol-1
zpe.correction: 0.112855 hartree
zpe.thermalcorrener: 0.122845 hartree
zpe.thermalcorrenthalpy: 0.123789 hartree
zpe.thermalcorrgfe: 0.078404 hartree
zpe.sumelectzpe: -702.065665 hartree
zpe.sumelectthermal: -702.055675 hartree
zpe.sumelectthermalent: -702.054731 hartree
zpe.sumelectthermalfe: -702.100116 hartree
dipole: 0.8328 0.2577 0.8408
dipole: 1.2111
quadrupole: -48.0903 -51.9614 -47.9162
quadrupole: -5.9227 -3.1476 -4.3889
quadrupole: 1.2323 -2.6387 1.4064 -5.9227 -3.1476 -4.3889
hfenergy: -702.1785201 hartree
pointgroup: C01 [X(C2H8N1O3P1)]
dipole: 0.3241978 0.1208474 0.3276383 debye
dipolederiv: 1.2872383 -0.0113897 0.0723499 -0.1131016 1.5140919 -0.0936004 -0.0537747 -0.0867301 1.7226489 -0.5394367 0.1275457 0.0316508 0.0737843 -0.5984396 -0.061888 0.1736684 -0.0795708 -1.1723718 -0.6971046 0.3323879 -0.0529143 0.4062491 -1.0527337 0.1937442 -0.0936383 0.1685104 -0.7249993 -0.8228525 -0.0850771 -0.0609187 -0.0646123 -0.6894319 -0.0552993 0.0520181 -0.0235195 -0.6559967 -1.0759042 0.2567347 0.0978391 0.3943091 -0.6621169 0.1007628 -0.0044579 0.1308 -0.2487524 0.9997044 -0.3153965 -0.036812 -0.5943815 0.46435 -0.0724656 -0.0197782 -0.1390074 0.0797989 -0.1613498 -0.0869801 -0.0303365 0.0225552 -0.0930955 -0.0150248 0.065413 -0.020526 0.0351903 -0.0134994 0.0331824 0.0098966 -0.0017074 0.0411544 -0.0288441 0.0047638 -0.0137185 -0.0947289 0.1202857 -0.0101483 0.0205965 0.0070184 0.0910547 0.0281339 -0.0172688 -0.0187228 -0.0971893 0.0904993 0.0901896 -0.0453242 0.0511951 -0.016698 0.0448146 -0.0345816 0.0629827 0.0782692 -0.1571883 -0.0440127 0.0564613 -0.0360459 0.0814362 -0.0166403 0.0345194 -0.0176917 0.0944374 0.3394361 -0.1323389 -0.1075725 -0.060275 0.120216 -0.0154328 -0.1171676 0.0371322 0.2003897 0.4118985 -0.0074155 0.0473117 0.0256891 0.1756868 -0.0283898 -0.0043845 -0.0119883 0.0851365 0.1401855 -0.1011548 0.0273469 -0.1004678 0.338311 0.0119244 0.0598641 -0.008302 0.3162205 0.0780878 -0.0461266 -0.0295747 -0.0102088 0.2862147 0.0082053 -0.0451952 0.0203517 0.381947 unknown
polarizability: 74.3649996|-1.2521312|63.6360468|2.6780961|-1.1641779|55.0988496 unknown
InChI: InChI=1S/C2H8NO3P/c1-2(3)7(4,5)6/h2,4-5H,3H2,1H3
charge 0 multiplicity 1
15 atoms
P  -0.745254 0.01138 -0.04296
O  -0.660111 0.202205 1.695118
O  -1.220408 1.575556 -0.663045
O  -1.738136 -1.16931 -0.470454
N  1.754038 -1.267584 0.087707
C  1.156165 -0.073542 -0.447801
C  1.829753 1.209622 0.063661
H  1.168198 -0.107179 -1.551143
H  1.774993 1.270792 1.164745
H  1.344299 2.107015 -0.3539
H  2.890706 1.19334 -0.240167
H  1.489077 -2.159138 -0.334596
H  1.866823 -1.294168 1.103181
H  -1.45628 -0.146957 2.171725
H  -2.180361 1.636467 -0.906269
