program: Gaussian 09
title: 000181848
version: EM64L-G09RevD.01
frameworkgroup: C1[X(C22H21NO6)]
method: RPBEPBE
basis: SDD
operation: Freq
keyword: #p
keyword: freq=noraman
keyword: PBEPBE/SDD
title: #p freq=noraman PBEPBE/SDD
converged: YES YES NO NO
title: Mulliken charges:
elementType: O O O O O O N C C C C C C C C C C C C C C C C C C C C C C H H H H H H H H H H H H H H H H H H H H H
charge: -0.277224 -0.212435 -0.258174 -0.268077 -0.280627 -0.180677 -0.076422 0.153559 0.135678 0.485055 0.201779 0.550214 -0.000473 0.068841 -0.575995 -0.070214 -0.506437 -0.021221 0.004068 -0.528197 -0.377677 -0.608445 0.154323 0.054961 -0.206830 -0.621211 -0.618314 -0.498595 -0.502705 0.264792 0.218348 0.259817 0.242601 0.213909 0.231245 0.269475 0.247178 0.245878 0.235041 0.189436 0.217729 0.225092 0.221039 0.188804 0.210279 0.255479 0.227456 0.223303 0.216885 0.277685
chargesum: 0.00000
title: Mulliken charges with hydrogens summed into heavy atoms:
elementType: O O O O O O N C C C C C C C C C C C C C C C C C C C C C C
charge: -0.277224 -0.212435 -0.258174 -0.268077 -0.280627 -0.180677 -0.076422 0.153559 0.135678 0.485055 0.201779 0.550214 -0.000473 0.068841 -0.092855 -0.070214 -0.246621 -0.021221 0.004068 -0.285596 0.067477 -0.338970 0.154323 0.054961 0.286226 0.020996 0.016620 0.194618 0.215168
polarizability: 4.60486277e+02 -3.38259482e+01 3.20397511e+02 1.77539978e+01 1.48275931e+01 1.42904201e+02
1716.lowfreq: -29.4967 -3.2140 -1.0085 0.0004 0.0009 0.0010 8.3822 21.1310 25.1416
frequency: -29.3632 21.1006 25.0102 33.0463 41.6749 42.9904 61.6585 76.8018 100.2280 109.0196 109.7106 125.2043 147.9830 150.1427 164.2370 177.9668 190.1403 214.2944 220.8237 232.5227 246.0605 246.9283 276.4655 286.7948 302.2816 318.0607 330.2706 339.6956 354.8413 371.6430 383.4931 403.4532 421.0586 437.1906 444.6587 453.3645 460.7302 473.5503 488.8343 530.4003 548.8211 587.3057 628.7607 631.2496 652.9961 664.1599 676.9789 693.3044 720.5640 725.7555 748.2830 771.0670 779.1172 807.6538 812.1013 822.3489 828.1759 844.7363 856.6089 861.2882 898.2290 905.1270 942.7629 975.5108 978.4795 995.3223 1012.0364 1022.5309 1029.0546 1036.3485 1053.4619 1061.7493 1072.9991 1092.1696 1093.6533 1103.2781 1105.5995 1107.4210 1119.7317 1133.2997 1145.7253 1151.1592 1166.0579 1169.5786 1189.0114 1206.2637 1221.2776 1262.9718 1274.9920 1283.9790 1295.7227 1301.0444 1330.1537 1361.9443 1366.1447 1372.4254 1394.1998 1395.8174 1414.1037 1419.7043 1429.5165 1440.7538 1442.6062 1449.6827 1451.9127 1452.6786 1454.4290 1461.6567 1463.6811 1470.0716 1471.9293 1476.8009 1479.1964 1481.6106 1482.3200 1488.0365 1501.4307 1507.1052 1587.1945 1592.5196 1616.1875 1629.7430 1669.1875 2848.2626 2854.9415 2869.5851 2983.0421 2991.1615 3014.0043 3016.2338 3017.3561 3023.0765 3029.5960 3074.8187 3081.0055 3087.6775 3093.4934 3102.9389 3104.9733 3125.2981 3133.1021 3136.0158 3164.5699 3171.4612
redmass: 2.2029 4.3511 2.4686 4.9957 3.9327 3.6505 2.4137 3.2544 2.6907 2.3792 3.6555 5.7931 1.8834 2.8619 2.9599 3.2807 3.4189 5.7829 4.8633 1.1716 1.5524 2.2585 4.6155 5.2508 4.5754 4.3625 3.7958 2.8471 4.4535 6.6623 5.2256 4.6919 3.1666 5.0588 5.4541 4.2989 4.6002 6.8671 7.3185 8.1124 5.3235 5.3056 6.7331 5.6633 7.5042 6.3872 6.9210 10.8225 7.5099 5.5871 6.4248 5.7183 2.4949 3.1762 2.3192 5.8726 2.5805 4.4737 6.8761 4.7136 1.6778 7.7112 7.0311 3.7209 1.5889 6.0271 3.0308 6.7341 1.9908 2.0485 2.5991 1.4578 2.7884 1.3421 3.0458 3.4797 1.3408 1.4179 1.0377 1.4098 1.5442 1.4706 1.8171 1.6250 1.7887 2.6487 1.6727 2.5292 3.7757 2.9913 1.2335 1.5399 5.1931 1.4768 1.3259 4.1133 2.8314 3.6339 3.3383 1.1657 1.4941 1.5173 1.1814 2.4931 1.1460 2.4959 1.5755 1.0596 1.0955 1.0537 1.0591 1.1091 1.0664 1.1069 1.1764 1.0822 5.7152 4.0077 8.9752 9.7485 8.5004 8.1228 12.9033 1.0570 1.0633 1.0633 1.0325 1.0322 1.0623 1.0728 1.0860 1.0536 1.0727 1.1012 1.1003 1.0995 1.0997 1.1007 1.1189 1.1052 1.0880 1.1055 1.0953 1.0932
irintensity: 14.4288 0.2872 1.5187 0.8732 2.3399 1.4918 0.7156 8.3758 0.1937 0.6378 1.9924 1.6709 1.9428 0.9118 0.6908 0.5278 1.3509 3.7403 5.5959 0.5084 0.1834 2.5855 0.9470 1.9223 4.2497 4.5427 2.9651 4.4956 3.0581 3.8596 1.5646 2.6609 1.0134 7.2869 1.4934 1.0028 9.1549 4.9089 3.7771 13.5001 3.2368 6.7179 3.3925 6.2003 4.2021 2.4364 0.5054 0.5280 4.2382 13.2701 9.5770 8.8125 2.6535 0.3285 9.7063 31.5506 42.4638 15.2456 69.3656 18.3066 51.4076 20.7622 47.5727 170.3832 36.0589 56.4713 8.9764 2.1641 89.0909 65.8661 53.0384 4.3255 183.3157 4.2377 32.5391 9.3483 16.7675 15.2600 0.0059 15.2345 4.4973 43.8186 9.1148 10.4258 108.5354 31.9871 5.5883 18.0473 65.8929 367.3983 8.0903 26.3970 121.9741 6.1110 7.4086 82.1179 185.0646 107.3786 2.2466 2.6600 36.2439 58.1360 3.9117 18.4881 10.0359 136.3190 27.8457 10.9398 25.2044 25.8284 22.8376 10.6062 15.5698 10.7473 3.9904 25.1662 2.8289 50.2027 86.4102 25.8899 0.6695 13.0233 378.3745 65.7670 87.4676 178.1574 83.2802 79.7162 14.0530 41.9396 35.2996 143.0896 48.0324 26.4854 46.3214 33.7748 43.2804 38.1964 24.3938 18.3983 4.6056 12.1819 14.6013 3.5762
temp: 298.150 k
press: 1.00000 atm
elementType: 8 8 8 8 8 8 7 6 6 6 6 6 6 6 6 6 6 6 6 6 6 6 6 6 6 6 6 6 6 1 1 1 1 1 1 1 1 1 1 1 1 1 1 1 1 1 1 1 1 1
symmnumber: 1
zpe: 1012994.8 jmol-1
zpe.correction: 0.385829 hartree
zpe.thermalcorrener: 0.412058 hartree
zpe.thermalcorrenthalpy: 0.413002 hartree
zpe.thermalcorrgfe: 0.328044 hartree
zpe.sumelectzpe: -1354.898127 hartree
zpe.sumelectthermal: -1354.871898 hartree
zpe.sumelectthermalent: -1354.870954 hartree
zpe.sumelectthermalfe: -1354.955913 hartree
dipole: -1.1079 -1.3245 -1.7853
dipole: 2.4837
quadrupole: -149.3310 -158.3242 -169.6333
quadrupole: -17.9740 -0.5087 -9.5990
quadrupole: 9.7652 0.7720 -10.5371 -17.9740 -0.5087 -9.5990
hfenergy: -1355.2839567 hartree
pointgroup: C01 [X(C22H21N1O6)]
dipole: -0.4290812 0.5346955 0.6963071 debye
polarizability: 463.7288921|27.4282695|317.5479156|-9.6343866|17.3412299|142.5111806 unknown
InChI: InChI=1S/C22H21NO6/c1-23(2)8-7-13-12-6-5-11-9-14-19(28-10-27-14)17-15(11)16(12)20(29-22(17)24)21(26-4)18(13)25-3/h5-6,9H,7-8,10H2,1-4H3
charge 0 multiplicity 1
50 atoms
O  1.13643 -2.287924 -0.402255
O  5.140556 -0.304115 -0.271715
O  5.373633 2.041065 0.184574
O  -3.721016 -1.815465 0.028987
O  -1.482431 -3.442715 -0.511556
O  3.38997 -2.601374 -0.63117
N  -5.194328 2.511202 -0.470058
C  0.151915 -0.100346 0.158985
C  1.467781 0.484642 0.167565
C  -1.022687 0.697137 0.392679
C  -2.317223 0.083284 0.371443
C  1.616799 1.891639 0.433669
C  0.009995 -1.489068 -0.11083
C  2.623357 -0.348648 -0.091213
C  -3.583494 0.88856 0.601795
C  -2.417959 -1.305078 0.108129
C  -0.832459 2.108257 0.644634
C  -1.254135 -2.114336 -0.144532
C  3.880259 0.274215 -0.056582
C  0.430254 2.677652 0.669458
C  -4.099469 1.540016 -0.710378
C  2.921807 2.484292 0.455201
C  4.010922 1.661811 0.213504
C  2.485722 -1.781556 -0.387538
C  6.131587 0.798777 -0.106163
C  -6.437017 1.878417 0.018992
C  -5.446985 3.355467 -1.656734
C  -4.039396 -3.150637 0.577019
C  -0.54989 -4.508372 -0.073515
H  -4.357598 0.215742 1.00455
H  -3.417905 1.693173 1.340504
H  -1.708444 2.739238 0.819599
H  0.546399 3.748974 0.867733
H  -4.403545 0.726748 -1.417462
H  -3.266079 2.090612 -1.187211
H  3.049424 3.551507 0.654649
H  6.683916 0.920861 -1.052579
H  6.784339 0.559858 0.750366
H  -6.252771 1.356105 0.972701
H  -6.86616 1.13852 -0.704611
H  -7.197236 2.658297 0.204745
H  -4.516023 3.872593 -1.95066
H  -6.202625 4.123944 -1.412234
H  -5.816699 2.779773 -2.543757
H  -3.526393 -3.316485 1.542792
H  -3.757231 -3.940816 -0.134387
H  -5.130276 -3.130511 0.730901
H  -1.113888 -5.442914 -0.220187
H  -0.28559 -4.383577 0.99249
H  0.365689 -4.501243 -0.681937
