program: Gaussian 09
title: 000181770
version: EM64L-G09RevD.01
frameworkgroup: C1[X(C11H12N4O2)]
method: RPBEPBE
basis: SDD
operation: Freq
keyword: #p
keyword: freq=noraman
keyword: PBEPBE/SDD
title: #p freq=noraman PBEPBE/SDD
converged: YES YES NO NO
title: Mulliken charges:
elementType: O O N N N N C C C C C C C C C C C H H H H H H H H H H H H
charge: -0.282933 -0.265204 -0.155806 -0.147621 -0.226292 -0.087447 0.152976 0.065187 -0.368418 0.193824 0.210681 -0.215361 -0.498518 -0.609936 -0.601495 0.212708 -0.490802 0.268304 0.225852 0.270535 0.295538 0.235740 0.271142 0.248251 0.248871 0.251907 0.252037 0.268469 0.277813
chargesum: 0.00000
title: Mulliken charges with hydrogens summed into heavy atoms:
elementType: O O N N N N C C C C C C C C C C C
charge: -0.282933 -0.265204 -0.155806 -0.147621 -0.226292 -0.087447 0.152976 0.065187 0.125737 0.193824 0.210681 0.055174 0.032759 0.158329 0.170918 0.212708 -0.212990
polarizability: 2.15846681e+02 3.67573654e+00 1.58372981e+02 -1.16608337e+01 -1.48380337e+00 8.03532980e+01
1716.lowfreq: -2.7920 0.0006 0.0007 0.0007 6.5296 9.1745 41.8774 48.7069 77.3887
frequency: 41.8714 48.6994 77.3717 92.0484 97.7267 110.9800 123.9577 141.6829 158.4313 174.3404 201.4905 280.8845 293.1627 308.4446 329.2362 350.0260 377.1546 387.6849 414.9821 426.2348 440.6685 490.9871 542.5056 611.5104 637.6429 641.8050 657.9595 669.4799 704.5929 741.4087 747.2205 776.6952 787.8887 807.3654 909.3094 956.4595 959.6091 1008.6033 1029.3816 1034.2414 1049.4506 1130.0286 1132.8631 1156.3886 1168.0592 1199.9787 1222.3100 1234.5926 1260.3082 1272.5573 1298.2273 1301.6911 1346.9881 1356.0203 1371.9518 1411.6070 1425.0672 1428.9604 1459.7233 1466.8624 1473.8117 1477.1465 1478.8053 1480.4613 1506.1751 1571.2113 1613.8891 1644.7212 2145.5430 2989.0715 3009.4414 3013.5572 3035.0804 3048.1760 3099.6515 3105.0914 3105.9404 3139.9479 3140.8956 3239.4953 3426.6620
redmass: 5.7843 5.5363 2.4047 1.2495 2.5005 3.0783 1.2222 3.7242 5.1681 5.3588 3.3796 3.4625 4.9708 4.2276 3.2983 3.7017 6.7559 8.1045 5.1550 6.9704 6.2965 7.1051 6.4079 4.2181 1.2329 6.4947 1.2326 8.7055 10.8150 4.4996 6.3515 1.7853 2.8979 1.4849 4.0335 5.2383 4.9466 2.9213 3.7342 1.9252 3.1424 1.3047 1.2988 1.7766 2.1699 2.5205 3.0208 2.0606 2.8853 1.8342 1.3818 6.1514 2.4040 1.5279 2.8161 1.6692 1.4739 1.5101 1.3362 1.1709 1.0437 1.0901 1.0426 1.1382 2.6157 8.2052 10.9451 9.9260 6.0335 1.0588 1.0335 1.0328 1.0600 1.1007 1.1026 1.1071 1.1022 1.1025 1.1014 1.0988 1.1593
irintensity: 0.1173 0.1106 0.5541 0.1893 0.6994 4.0837 0.4159 4.9942 0.1300 9.6528 6.2558 2.0823 0.3285 1.4430 11.4193 9.1103 7.8711 18.7874 6.5863 5.0668 15.5886 20.0878 0.8427 16.1666 72.6743 2.6372 73.8020 0.0480 10.4461 15.9015 10.2801 3.3197 1.5222 25.2603 4.1612 21.4122 10.1575 61.0242 2.0803 1.8461 12.0679 0.2999 0.1735 18.1053 46.8595 52.7900 21.9230 20.3021 29.0939 14.3065 8.8393 23.0140 40.3671 24.0158 10.9030 37.8101 66.4019 115.9364 62.6555 29.2588 17.4612 25.3556 17.6341 27.1346 112.8305 8.2075 710.7405 334.0010 8.4639 9.1106 35.4908 24.6380 21.1967 3.6042 16.6934 5.3809 16.3507 0.7081 0.4122 1.5135 77.5920
temp: 298.150 k
press: 1.00000 atm
elementType: 8 8 7 7 7 7 6 6 6 6 6 6 6 6 6 6 6 1 1 1 1 1 1 1 1 1 1 1 1
symmnumber: 1
zpe: 580369.2 jmol-1
zpe.correction: 0.221051 hartree
zpe.thermalcorrener: 0.237429 hartree
zpe.thermalcorrenthalpy: 0.238373 hartree
zpe.thermalcorrgfe: 0.176682 hartree
zpe.sumelectzpe: -794.562909 hartree
zpe.sumelectthermal: -794.546531 hartree
zpe.sumelectthermalent: -794.545587 hartree
zpe.sumelectthermalfe: -794.607279 hartree
dipole: 2.2713 -2.2263 -0.2522
dipole: 3.1904
quadrupole: -100.3364 -100.6252 -98.3636
quadrupole: -2.4962 -1.0048 0.9836
quadrupole: -0.5613 -0.8501 1.4114 -2.4962 -1.0048 0.9836
hfenergy: -794.7839603 hartree
pointgroup: C01 [X(C11H12N4O2)]
dipole: -0.8970647 0.8661366 -0.1435539 debye
polarizability: 215.409829|4.4673989|158.4355226|13.5878715|-1.115142|80.7276087 unknown
InChI: InChI=1S/C11H12N4O2/c1-4-5-6-15-7-12-9-8(15)10(16)14(3)11(17)13(9)2/h1,7H,5-6H2,2-3H3
charge 0 multiplicity 1
29 atoms
O  -0.620613 -2.05572 -0.357908
O  3.903503 -0.945668 0.383566
N  -1.12065 1.031568 -0.439248
N  2.387109 0.831718 0.158888
N  1.647744 -1.465876 0.010041
N  0.597063 2.517039 -0.131886
C  0.045022 0.272009 -0.234848
C  1.072837 1.214364 -0.056043
C  -2.487592 0.519205 -0.657719
C  0.2631 -1.151926 -0.211147
C  2.721307 -0.542971 0.196013
C  -0.733479 2.360654 -0.361469
C  -3.088301 -0.110382 0.632085
C  3.442534 1.847951 0.341723
C  2.032078 -2.896125 0.056639
C  -4.503731 -0.464272 0.438958
C  -5.688923 -0.751447 0.256361
H  -2.463345 -0.243291 -1.453395
H  -3.111007 1.364517 -0.995949
H  -1.436777 3.181287 -0.483146
H  -2.504875 -1.016277 0.880985
H  -2.989194 0.603065 1.472683
H  4.392917 1.316319 0.493289
H  3.212602 2.477459 1.217361
H  3.503502 2.493437 -0.550227
H  2.500758 -3.12895 1.02649
H  2.760075 -3.117941 -0.740619
H  1.115233 -3.486943 -0.082679
H  -6.7201 -1.015005 0.106704
