program: Gaussian 09
title: 000016486
version: EM64L-G09RevD.01
frameworkgroup: C1[X(C4H7NO2)]
method: RPBEPBE
basis: SDD
operation: Freq
keyword: #pfreq=noraman
keyword: PBEPBE/SDD
title: #p freq=noraman PBEPBE/SDD
converged: NO YES NO NO
title: Mulliken charges:
elementType: O O N C C C C H H H H H H H
charge: -0.407056 -0.239842 -0.315170 -0.187956 -0.457557 -0.399567 0.162014 0.265930 0.242118 0.240787 0.209398 0.229441 0.278271 0.379189
chargesum: 0.00000
title: Mulliken charges with hydrogens summed into heavy atoms:
elementType: O O N C C C C
charge: -0.027867 -0.239842 -0.036898 0.077974 0.025348 0.039272 0.162014
polarizability: 6.30490842e+01 -1.24810838e+00 5.48486022e+01 1.75305142e-01 -2.25147643e+00 4.25447798e+01
1716.lowfreq: -27.1887 -13.7677 -5.7924 -0.0010 -0.0006 -0.0005 50.3656 112.6562 202.1300
frequency: 49.3159 112.6213 202.1281 274.1503 412.2479 565.1731 578.7068 635.5646 682.6187 748.7412 798.2525 881.9324 937.1592 971.5890 1006.0167 1025.5376 1075.6849 1086.3899 1130.7366 1175.3889 1195.2853 1248.0556 1254.9387 1299.1879 1321.6443 1375.2089 1467.4737 1493.1178 1645.5235 2974.7571 3027.2717 3053.6190 3061.5861 3129.6039 3426.0417 3507.5864
redmass: 5.5840 2.4213 3.3812 3.2009 4.9212 2.3771 1.8211 2.1936 2.8484 1.6149 2.1173 2.2792 2.7626 1.8853 3.3161 3.2962 1.8033 2.0397 1.4799 1.1614 1.4184 1.4153 1.3512 1.4009 1.6210 1.4197 1.0928 1.0990 8.6286 1.0641 1.0843 1.0701 1.0929 1.1088 1.0759 1.0641
irintensity: 1.0818 3.0972 0.3837 15.7613 28.1629 59.8065 16.7741 181.8236 44.6577 4.0202 14.7262 32.1586 2.0185 7.9030 6.8899 232.8014 6.9707 29.2536 14.0483 0.3639 6.8348 1.6641 13.8700 50.5464 21.1384 5.6171 5.3150 3.4044 211.7577 79.3005 25.4027 25.4854 46.6481 22.4825 1.6319 19.0453
temp: 298.150 k
press: 1.00000 atm
elementType: 8 8 7 6 6 6 6 1 1 1 1 1 1 1
symmnumber: 1
zpe: 292073.4 jmol-1
zpe.correction: 0.111245 hartree
zpe.thermalcorrener: 0.118117 hartree
zpe.thermalcorrenthalpy: 0.119061 hartree
zpe.thermalcorrgfe: 0.079664 hartree
zpe.sumelectzpe: -361.235069 hartree
zpe.sumelectthermal: -361.228197 hartree
zpe.sumelectthermalent: -361.227253 hartree
zpe.sumelectthermalfe: -361.266650 hartree
dipole: 0.4741 -1.4654 -1.0132
dipole: 1.8436
quadrupole: -37.1224 -44.2320 -42.5932
quadrupole: -0.8392 2.1443 0.9917
quadrupole: 4.1935 -2.9161 -1.2773 -0.8392 2.1443 0.9917
hfenergy: -361.3463141 hartree
pointgroup: C01 [X(C4H7N1O2)]
dipole: 0.1762736 0.1130373 -0.6944279 debye
dipolederiv: -0.9404871 0.282871 0.4409772 0.1928692 -0.3676519 -0.0655682 0.4414801 -0.11709 -0.6893394 -0.628669 -0.1552444 -0.0607342 -0.0709808 -0.6537922 -0.3895094 0.0992817 -0.2786032 -0.6374375 -0.5314804 0.0360288 0.0756956 0.0516132 -0.3552945 0.183392 0.1122068 0.1680605 -0.4715555 0.0662424 -0.1622474 -0.1676308 -0.2668335 0.2281765 0.0007947 -0.3949409 -0.0336491 0.0826355 0.0427947 0.1111361 0.0474309 0.0233258 0.0657268 -0.0416659 0.0645324 0.0058653 0.0716835 0.4269423 -0.0335285 0.1123197 -0.0176619 0.2684642 -0.0748864 0.2241472 -0.1437554 0.1614934 1.286629 0.0781622 -0.2827606 0.139551 0.7029334 0.6007229 -0.3735397 0.5503906 0.8348404 -0.0156221 0.0748067 0.0142714 0.1019393 -0.0885299 -0.0141439 0.0231269 -0.0109905 0.080374 0.0229123 -0.0719571 -0.0556906 -0.0525171 -0.0391577 -0.1031655 -0.0514354 -0.0726939 0.0208109 0.0549501 -0.0485172 0.0802384 -0.0378535 0.0173773 0.1070054 0.0493129 0.0576144 -0.0385292 0.036035 -0.0275226 -0.0144523 0.0556556 -0.2355817 0.0351335 -0.0311759 0.0317858 0.0263392 -0.2235275 0.0081897 -0.0402542 -0.0452166 0.0652467 0.0134075 -0.0263473 0.0105373 0.066446 0.183599 0.0192752 -0.1367486 0.0663063 0.1574953 -0.1737626 -0.0788533 -0.0765582 0.16697 0.2196814 -0.1114527 -0.012662 -0.1401969 0.2345877 -0.0777541 -0.0577954 -0.0909135 0.325269 unknown
polarizability: 63.0567015|0.4616251|46.7616284|-1.527131|6.174085|50.6241362 unknown
InChI: InChI=1S/C4H7NO2/c6-4(7)3-1-2-5-3/h3,5-6H,1-2H2
charge 0 multiplicity 1
14 atoms
O  2.012277 -0.281899 -0.70575
O  1.202874 1.062041 1.011779
N  -1.320767 -0.381978 1.037926
C  -0.230407 -0.72664 0.070475
C  -1.171499 -0.285661 -1.117252
C  -2.089245 0.369321 -0.029977
C  1.026565 0.122096 0.202612
H  0.064547 -1.790801 0.069296
H  -1.630104 -1.149598 -1.621556
H  -0.726857 0.385859 -1.866639
H  -1.97551 1.47176 0.015765
H  -3.160701 0.111294 -0.067463
H  -1.022665 0.16147 1.862831
H  2.823692 0.284237 -0.591747
