program: Gaussian 09
title: 000181757
version: EM64L-G09RevD.01
frameworkgroup: C1[X(C24H27N)]
method: RPBEPBE
basis: SDD
operation: Freq
keyword: #pfreq=noraman
keyword: PBEPBE/SDD
title: #p freq=noraman PBEPBE/SDD
converged: YES YES NO NO
title: Mulliken charges:
elementType: N C C C C C C C C C C C C C C C C C C C C C C C C H H H H H H H H H H H H H H H H H H H H H H H H H H H
charge: -0.297273 -0.350041 -0.457653 -0.385041 -0.027628 0.512800 0.451345 -0.614904 -0.712922 0.501498 -0.455751 -0.395487 -0.392576 -0.420141 -0.393254 -0.433206 -0.227944 -0.232648 -0.231033 -0.248931 -0.248379 -0.244843 -0.235703 -0.227894 -0.244123 0.209020 0.186208 0.230957 0.197942 0.210170 0.199849 0.236686 0.193220 0.231485 0.235910 0.218675 0.216087 0.231616 0.234846 0.243543 0.248411 0.230446 0.234847 0.224493 0.223435 0.223128 0.222750 0.227319 0.227075 0.223066 0.223608 0.226938
chargesum: 0.00000
title: Mulliken charges with hydrogens summed into heavy atoms:
elementType: N C C C C C C C C C C C C C C C C C C C C C C C C
charge: -0.060587 -0.141021 -0.040488 0.023071 0.172221 0.512800 0.451345 -0.190199 -0.042250 0.501498 -0.224134 -0.160641 -0.149033 -0.171730 -0.162809 -0.198359 -0.003450 -0.009212 -0.007905 -0.026180 -0.021060 -0.017768 -0.012637 -0.004286 -0.017185
polarizability: 3.10867764e+02 2.42358293e+01 2.62728318e+02 1.61270433e+01 6.42694041e+00 1.97643656e+02
1716.lowfreq: -5.6802 -2.6897 -0.0008 -0.0007 0.0003 4.6591 9.7234 19.6028 22.2996
frequency: 9.0404 19.0355 22.1469 32.3412 42.1352 45.8758 50.4772 58.0073 77.7453 96.4225 113.1240 154.1290 161.6407 181.8172 213.6048 218.6649 243.5023 259.5543 291.5696 317.2214 341.6025 367.7306 401.4362 403.9723 404.1623 429.5032 434.3542 468.0992 484.4292 517.4685 556.8801 579.3426 599.8351 614.9832 617.2122 618.1028 632.0102 680.5727 703.9524 706.0699 707.5270 734.6506 752.7368 762.9584 779.9917 816.3380 839.0135 841.6090 848.1153 853.6588 854.3459 854.9650 892.1563 917.6417 921.6327 925.9555 946.3773 974.5907 976.6249 976.8128 989.2076 990.1865 990.5892 993.1580 993.9891 994.1502 1009.3333 1026.1900 1027.5581 1030.0664 1044.3595 1045.3776 1065.2758 1075.7380 1081.9379 1093.8076 1108.3513 1136.4502 1152.2630 1171.0647 1171.2473 1171.9678 1183.7445 1187.4272 1188.1997 1190.9578 1193.3497 1207.6705 1212.2835 1222.3183 1246.3397 1270.6878 1284.0520 1296.7439 1310.9131 1320.6474 1331.2978 1335.6998 1340.2019 1344.8977 1372.6037 1379.4577 1381.6268 1383.3459 1383.9039 1436.3688 1439.1538 1440.7723 1461.3073 1467.3285 1469.6949 1471.2067 1480.2189 1481.3336 1483.6475 1484.5324 1496.7631 1589.8562 1592.0693 1592.7316 1609.1781 1614.1264 1614.4052 2841.5085 2882.1673 2957.8737 2959.3053 2970.5389 2983.6002 3006.8565 3041.7832 3045.1602 3079.8231 3089.4885 3110.9846 3112.7870 3114.9796 3117.7285 3118.2866 3123.2945 3131.5253 3131.6570 3136.9509 3142.1723 3142.5641 3148.4687 3161.0413 3161.3340 3162.5140 3398.3445
redmass: 4.6827 4.1595 3.6532 4.2687 3.7952 4.0872 3.3242 4.7251 4.1288 3.2756 1.9197 4.7625 4.7523 2.5119 1.6032 2.8851 3.1744 3.2621 4.2400 3.7586 2.7645 2.5700 2.8175 2.8305 2.8206 3.2829 2.5270 3.5543 3.1276 2.9252 3.3312 3.9276 3.6592 5.9077 6.3280 6.0655 4.3679 1.5181 1.7723 1.7554 1.6958 2.4578 1.8673 1.6790 2.0532 3.6803 2.3641 2.0995 2.0045 1.2514 1.3057 1.2566 1.3834 1.5008 1.4260 1.5347 2.0608 1.3866 1.3901 1.4103 5.1650 6.2273 5.5480 1.3129 1.3195 1.3502 2.6112 2.2001 2.2560 1.9410 2.5608 1.7272 2.4544 1.8635 1.6301 1.6768 1.7662 1.9837 2.6199 1.0612 1.0539 1.0521 1.5725 1.1256 1.1177 2.4382 1.1598 1.8350 1.6110 2.0832 1.3511 1.3631 1.3175 1.2400 1.3449 1.3526 1.2773 1.2765 1.3578 1.4008 1.4662 3.6269 7.0189 1.6791 4.4395 2.2134 2.1461 2.1488 1.1521 1.1089 1.1206 1.1388 2.1977 1.1336 2.0003 2.1538 1.0903 6.0266 6.0359 5.9823 6.0628 6.1538 6.0484 1.0811 1.0695 1.0704 1.0647 1.0758 1.0360 1.0856 1.0961 1.0994 1.0993 1.0996 1.0873 1.0867 1.0864 1.0864 1.0860 1.0864 1.0908 1.0911 1.0920 1.0958 1.0960 1.0948 1.1014 1.1015 1.1012 1.0734
irintensity: 0.0271 0.0464 0.0203 0.0257 0.0570 0.1206 0.1983 0.2474 0.0897 0.4832 3.2451 0.2241 0.3303 0.8553 0.9218 0.4615 0.9946 0.4438 0.2949 0.6168 1.5608 0.1670 0.2339 0.1447 0.0110 3.2940 7.8124 4.2208 1.2864 20.1300 17.4652 7.8077 21.5788 1.8898 0.1550 2.2934 8.6563 51.0060 49.7073 47.5446 58.8424 14.8475 59.6862 45.9083 23.2326 3.8742 1.5232 0.9904 1.3444 0.0280 0.4666 0.2418 1.8080 2.2556 5.1653 1.8573 0.1698 0.1353 0.0495 0.0471 0.3300 0.0400 0.3336 0.1796 0.2505 0.3638 5.2450 7.5967 14.5784 3.5734 3.1193 1.3980 9.4983 12.6278 1.6383 10.5189 6.3927 1.8960 67.9313 0.1220 0.2901 0.1280 20.8729 0.8575 0.5082 0.9561 1.6060 5.7958 2.1322 5.7300 7.9913 3.6804 0.8023 5.3913 3.4677 10.4976 5.4732 2.2327 34.7521 18.5883 12.3922 5.4494 0.3054 10.9134 0.7533 10.3207 7.1215 6.2764 22.2156 8.0954 10.5054 10.3328 21.1855 14.6460 16.8623 16.7546 4.4028 3.8248 1.2767 0.0704 14.0188 15.0472 1.9842 74.4011 78.2261 3.9152 40.7144 28.9041 14.1398 25.0122 14.9523 53.9600 43.1365 31.1164 9.8626 11.0957 6.6645 4.2687 2.8600 0.1010 9.9930 13.4360 21.8295 40.1501 45.9852 42.4573 27.8803 27.1783 20.0941 4.0103
temp: 298.150 k
press: 1.00000 atm
elementType: 7 6 6 6 6 6 6 6 6 6 6 6 6 6 6 6 6 6 6 6 6 6 6 6 6 1 1 1 1 1 1 1 1 1 1 1 1 1 1 1 1 1 1 1 1 1 1 1 1 1 1 1
symmnumber: 1
zpe: 1159035.2 jmol-1
zpe.correction: 0.441453 hartree
zpe.thermalcorrener: 0.464858 hartree
zpe.thermalcorrenthalpy: 0.465802 hartree
zpe.thermalcorrgfe: 0.383404 hartree
zpe.sumelectzpe: -983.692581 hartree
zpe.sumelectthermal: -983.669176 hartree
zpe.sumelectthermalent: -983.668232 hartree
zpe.sumelectthermalfe: -983.750631 hartree
dipole: -0.1376 0.8941 -0.2533
dipole: 0.9395
quadrupole: -146.2528 -144.2486 -144.6141
quadrupole: 2.5276 2.5550 1.5721
quadrupole: -1.2143 0.7899 0.4244 2.5276 2.5550 1.5721
hfenergy: -984.1340343 hartree
pointgroup: C01 [X(C24H27N1)]
dipole: -0.0504871 -0.3501328 0.1071105 debye
polarizability: 311.4282657|-24.0575705|262.4478555|-15.5313297|4.8300654|197.3636168 unknown
InChI: InChI=1S/C24H27N/c1-20(19-21-11-5-2-6-12-21)25-18-17-24(22-13-7-3-8-14-22)23-15-9-4-10-16-23/h2-16,20,24-25H,17-19H2,1H3
charge 0 multiplicity 1
52 atoms
N  1.277051 1.019072 0.093256
C  -2.460525 0.239079 -0.591643
C  -1.195106 0.90491 0.020259
C  0.123078 0.359147 -0.5615
C  2.624476 0.538144 -0.313299
C  -2.538784 -1.253148 -0.22504
C  -3.768682 0.965295 -0.230224
C  3.662805 1.16256 0.665947
C  2.92488 0.921305 -1.776948
C  5.077423 0.637698 0.477615
C  -2.23144 -2.254505 -1.179836
C  -4.951152 0.637034 -0.946099
C  -2.898605 -1.657824 1.08703
C  -3.857328 1.938871 0.796105
C  5.413246 -0.686235 0.867449
C  6.090583 1.444729 -0.100142
C  -2.275086 -3.625634 -0.836072
C  -6.180755 1.262564 -0.652825
C  -2.939338 -3.024973 1.43649
C  -5.089274 2.566933 1.097027
C  -2.626688 -4.016217 0.475857
C  -6.255695 2.233497 0.374479
C  6.71974 -1.189882 0.683109
C  7.400867 0.946334 -0.286569
C  7.7203 -0.374347 0.103492
H  -2.351646 0.296747 -1.695434
H  -1.196397 0.753371 1.120402
H  -1.223151 1.996479 -0.1581
H  0.154655 0.583257 -1.64539
H  0.15224 -0.753388 -0.458878
H  2.701461 -0.576854 -0.224911
H  1.175741 0.968092 1.119099
H  3.325203 0.946334 1.702006
H  3.630569 2.260721 0.538619
H  3.95552 0.632708 -2.047582
H  2.810292 2.01284 -1.908762
H  2.239371 0.414345 -2.479079
H  -1.956672 -1.959288 -2.200666
H  -4.903425 -0.123113 -1.736112
H  -3.16727 -0.897906 1.831012
H  -2.96544 2.221791 1.364784
H  4.645799 -1.323036 1.32611
H  5.850417 2.471328 -0.40326
H  -2.036183 -4.385154 -1.58939
H  -7.078779 0.995101 -1.221509
H  -3.222594 -3.319334 2.453722
H  -5.134883 3.318218 1.894002
H  -2.662886 -5.077779 0.745326
H  -7.208978 2.72191 0.605742
H  6.959689 -2.213353 0.993782
H  8.169955 1.58741 -0.732683
H  8.735402 -0.762154 -0.038166
