program: Gaussian 09
title: 000181723
version: EM64L-G09RevD.01
frameworkgroup: C1[X(C17H14O)]
method: RPBEPBE
basis: SDD
operation: Freq
keyword: #pfreq=noraman
keyword: PBEPBE/SDD
title: #p freq=noraman PBEPBE/SDD
converged: YES YES NO NO
title: Mulliken charges:
elementType: O C C C C C C C C C C C C C C C C C H H H H H H H H H H H H H H
charge: -0.455463 0.128163 -0.226433 -0.475858 -0.557197 0.281233 0.217144 0.267308 -0.471152 -0.421541 0.165572 -0.422660 0.430219 -0.497743 -0.356334 -0.443130 -0.260069 -0.252326 0.216542 0.209694 0.238665 0.228730 0.228680 0.239756 0.222716 0.279299 0.232477 0.341011 0.219149 0.240661 0.225476 0.227413
chargesum: 0.00000
title: Mulliken charges with hydrogens summed into heavy atoms:
elementType: O C C C C C C C C C C C C C C C C C
charge: -0.114452 0.128163 -0.009891 -0.027499 -0.099787 0.281233 0.217144 0.267308 -0.231397 -0.198825 0.165572 -0.143361 0.430219 -0.265266 -0.137185 -0.202469 -0.034594 -0.024912
polarizability: 3.09164315e+02 -1.01035883e+01 1.96746556e+02 -4.52393836e+00 -4.67093764e+00 8.40544101e+01
1716.lowfreq: -0.0004 0.0001 0.0007 2.7561 6.0233 10.9780 58.3210 69.8636 107.2010
frequency: 58.3125 69.8437 107.1996 143.6624 163.4210 187.1314 229.7534 255.8007 262.9308 305.3672 336.3597 394.7185 406.1282 427.9815 473.8347 477.0056 515.5178 525.8222 541.3419 556.5838 584.5594 595.5085 626.7458 659.7454 684.6900 734.9403 760.6884 775.6597 789.3208 833.2323 838.7104 850.4112 859.0067 867.3785 889.2518 927.4341 952.8282 961.0679 963.5634 986.0880 988.3232 996.9556 1021.3141 1033.8659 1045.2595 1053.8997 1130.5962 1148.4877 1159.4217 1165.7993 1176.5119 1178.6653 1197.9691 1231.8515 1242.7200 1248.8078 1267.4872 1271.6697 1282.3355 1310.6219 1317.0116 1362.4542 1383.2277 1402.8285 1405.5354 1423.2639 1444.6173 1454.7246 1465.0759 1473.2661 1500.9752 1538.4067 1584.5008 1602.9749 1621.8026 1628.7587 2920.8584 2978.7165 3007.1947 3040.9369 3075.5307 3119.8215 3123.8400 3127.3789 3132.0971 3148.1635 3158.6074 3165.8880 3169.3010 3554.8328
redmass: 4.6402 4.1952 3.3409 2.5816 4.9353 3.8945 3.7827 4.1873 1.1429 3.7498 5.5294 3.6147 3.7327 3.4407 4.4284 4.6600 3.1544 3.7937 5.6144 4.1979 4.2744 3.9393 4.4271 3.1487 5.2315 2.6133 1.3833 3.5562 1.9781 1.4281 4.0154 2.0247 3.7514 2.0590 1.9175 2.8083 1.4107 2.6505 1.6334 1.4089 2.9335 1.4055 2.6775 2.6029 2.1877 3.0865 1.7493 1.3275 1.3431 1.3075 1.1106 1.2620 1.3976 2.0049 1.5291 1.6103 1.3097 1.7230 1.3404 2.0076 2.2811 1.7401 3.3989 2.6578 7.0735 2.9298 3.4775 1.9335 1.2655 1.0993 3.6039 4.5179 7.9123 6.4272 6.8514 6.7434 1.0834 1.0638 1.0615 1.0968 1.1049 1.0866 1.0887 1.0878 1.0887 1.0946 1.0960 1.0972 1.0955 1.0662
irintensity: 1.5381 2.1500 0.4775 2.0509 2.7127 3.0340 13.4343 6.9122 114.0227 1.4651 2.7566 2.2586 0.9037 14.7272 4.1235 3.9016 2.8025 4.4381 1.0678 6.0295 1.1991 2.2977 3.3954 1.7515 2.5586 2.2699 67.5705 11.6932 6.3207 41.9299 4.3054 0.9845 7.4152 28.3831 17.6761 30.9129 3.8017 16.2327 5.8953 0.4188 3.4866 0.2410 21.7305 14.9972 2.0100 2.7350 20.4956 13.2717 18.1015 1.8681 3.9247 6.8106 8.0065 4.3321 8.5879 11.4550 2.2953 3.6637 1.8036 7.6819 2.6500 11.9219 0.2157 0.5150 1.2285 11.8779 0.9821 13.3863 8.6223 8.2239 14.2202 1.4891 0.2110 5.1573 7.6781 6.0191 50.6760 41.5171 45.4011 33.8258 46.9842 0.7527 14.5415 6.3699 16.7767 17.8188 24.0544 43.4433 9.4769 3.6366
temp: 298.150 k
press: 1.00000 atm
elementType: 8 6 6 6 6 6 6 6 6 6 6 6 6 6 6 6 6 6 1 1 1 1 1 1 1 1 1 1 1 1 1 1
symmnumber: 1
zpe: 676277.1 jmol-1
zpe.correction: 0.257580 hartree
zpe.thermalcorrener: 0.271245 hartree
zpe.thermalcorrenthalpy: 0.272189 hartree
zpe.thermalcorrgfe: 0.217587 hartree
zpe.sumelectzpe: -730.220100 hartree
zpe.sumelectthermal: -730.206436 hartree
zpe.sumelectthermalent: -730.205492 hartree
zpe.sumelectthermalfe: -730.260094 hartree
dipole: -2.1916 0.2206 1.1799
dipole: 2.4988
quadrupole: -81.6655 -91.6525 -111.5007
quadrupole: 2.8680 -3.5207 -3.2870
quadrupole: 13.2741 3.2870 -16.5611 2.8680 -3.5207 -3.2870
hfenergy: -730.4776805 hartree
pointgroup: C01 [X(C17H14O1)]
dipole: 0.8525765 0.0722003 -0.4841176 debye
polarizability: 309.2140406|7.8200652|196.2637383|-9.7384439|5.6017724|84.4875019 unknown
InChI: InChI=1S/C17H14O/c18-16-10-7-12-6-8-14-13-4-2-1-3-11(13)5-9-15(14)17(12)16/h1-6,8-9,16,18H,7,10H2
charge 0 multiplicity 1
32 atoms
O  2.950268 -2.314864 0.49476
C  1.939519 -0.151194 -0.166641
C  3.091572 -1.125411 -0.375408
C  4.353905 -0.277147 -0.033691
C  3.939429 1.207941 -0.25902
C  2.425115 1.16563 -0.112682
C  0.538848 -0.431274 -0.11224
C  -0.382288 0.677597 0.012628
C  1.525634 2.254671 0.017689
C  0.147531 2.004791 0.080608
C  -1.824494 0.408908 0.056738
C  0.028382 -1.783862 -0.184919
C  -2.288256 -0.954451 -0.034141
C  -1.330007 -2.030134 -0.153775
C  -2.80632 1.441128 0.182658
C  -3.690217 -1.232204 0.001217
C  -4.176758 1.148022 0.215413
C  -4.627375 -0.200309 0.123579
H  3.114023 -1.463593 -1.436758
H  5.243133 -0.570442 -0.619932
H  4.570773 -0.4430 1.038029
H  4.219405 1.550047 -1.275597
H  4.422619 1.898195 0.456205
H  1.902561 3.282546 0.067961
H  -0.532713 2.855709 0.180943
H  0.753426 -2.600775 -0.23151
H  -1.709211 -3.057867 -0.207703
H  3.703322 -2.931279 0.307654
H  -2.49421 2.487321 0.256366
H  -4.021242 -2.275358 -0.068601
H  -4.905669 1.96032 0.312563
H  -5.699607 -0.423159 0.149807
