program: Gaussian 09
title: 000181722
version: EM64L-G09RevD.01
frameworkgroup: C1[X(C18H14O)]
method: RPBEPBE
basis: SDD
operation: Freq
keyword: #pfreq=noraman
keyword: PBEPBE/SDD
title: #p freq=noraman PBEPBE/SDD
converged: NO YES NO NO
title: Mulliken charges:
elementType: O C C C C C C C C C C C C C C C C C C H H H H H H H H H H H H H H
charge: -0.176971 0.021663 0.326695 0.252788 -0.615575 0.121045 -0.631305 0.409148 0.122552 -0.691686 0.195347 -0.436799 0.424907 -0.519188 -0.900603 -0.342777 -0.454934 -0.286069 -0.253015 0.261523 0.261696 0.259919 0.259754 0.240638 0.247008 0.238434 0.236043 0.246799 0.235899 0.245658 0.243120 0.226490 0.231794
chargesum: 0.00000
title: Mulliken charges with hydrogens summed into heavy atoms:
elementType: O C C C C C C C C C C C C C C C C C C
charge: -0.176971 0.021663 0.326695 0.252788 -0.092355 0.121045 -0.111632 0.409148 0.122552 -0.451048 0.195347 -0.189791 0.424907 -0.280754 -0.181862 -0.097119 -0.211814 -0.059579 -0.021221
polarizability: 3.25596324e+02 -9.01341465e+00 2.10564837e+02 -4.63678225e-03 -1.21996256e-02 8.64053503e+01
1716.lowfreq: -13.6291 -7.8900 -5.7471 -4.7040 -0.0008 0.0005 0.0005 50.5014 76.8384
frequency: -13.5934 50.4988 76.8156 126.1839 160.7423 176.5344 216.1210 266.6950 268.6624 313.2117 329.5132 355.9181 359.7254 416.0019 425.5378 456.5971 469.3647 492.7989 494.7228 519.3554 546.2321 561.2341 599.0526 604.3035 618.7323 663.7632 683.5471 731.5159 758.5425 758.7106 789.5726 812.3946 822.7694 832.7154 859.0610 867.2281 883.1987 889.5888 955.7652 969.7188 979.2582 983.8512 984.2581 993.4541 1038.6394 1048.1200 1053.1868 1096.8284 1107.7405 1132.5814 1148.6792 1161.5777 1180.9535 1185.7446 1214.8224 1229.1386 1236.0654 1252.6429 1276.3106 1297.5448 1314.4290 1366.2004 1381.2070 1395.8841 1403.2858 1415.0096 1417.4026 1423.3076 1439.1270 1460.6234 1488.9585 1497.9014 1505.9757 1543.3649 1586.7838 1605.2297 1622.9344 1638.1891 1671.3293 2974.8346 2979.7423 2987.9473 3025.8386 3034.2104 3056.9988 3079.2516 3122.2286 3125.6148 3126.1954 3135.4942 3153.5315 3161.6441 3262.8949
redmass: 3.4338 5.9270 3.4830 2.8504 6.5173 2.9319 3.7308 3.0686 6.3272 3.5316 1.8006 1.7562 5.2674 2.5403 5.9242 2.3769 4.9256 2.9353 5.3917 3.1342 6.7237 4.6132 2.9126 5.3713 3.0280 5.5799 5.5829 2.6540 1.3044 5.4083 3.7077 2.1182 1.4484 4.5009 1.7689 4.8924 1.8497 1.6790 1.3796 2.0899 4.9295 2.6791 1.3733 1.3834 1.9873 1.5814 2.3547 3.1870 1.2136 3.7682 1.8930 1.2461 1.1693 1.3553 1.5751 1.6493 1.8907 1.8508 1.7226 2.6204 3.2154 4.1470 4.3589 6.1364 1.2583 1.5126 1.2173 1.3038 3.3290 2.5159 1.0484 1.1440 3.7843 4.1711 8.4009 6.3605 6.3151 7.1216 12.4336 1.0379 1.0604 1.0611 1.0988 1.0988 1.0985 1.0971 1.0872 1.0912 1.0865 1.0908 1.0978 1.0995 1.0889
irintensity: 0.0613 3.5939 2.8361 4.9946 0.0692 7.5132 2.3423 2.1054 0.5850 0.4709 0.3536 6.2441 2.7757 1.8410 0.2342 0.0121 3.0898 2.7583 1.1444 0.4050 0.9667 9.4210 0.6885 2.1853 6.6757 0.2245 7.3620 8.0945 51.7118 1.4914 3.2130 4.8178 36.9247 0.9076 6.5527 2.0544 0.6168 28.5308 3.3045 3.8280 0.3296 6.9038 0.9441 1.3319 1.7573 7.7025 6.4589 2.2574 0.4876 60.5059 8.2742 0.3250 1.9493 2.0326 0.3284 9.6879 4.6055 0.8421 1.8359 6.9934 3.9947 1.4130 2.3942 0.1018 11.8068 22.6409 5.9089 2.4411 13.0507 28.1693 13.7110 25.7345 0.1846 1.7564 2.6196 9.6100 1.2544 7.7506 290.8139 30.1998 12.9932 30.5714 4.4454 3.9641 14.9427 27.0534 1.3164 22.4515 1.4793 17.9140 24.7094 39.9122 7.8166
temp: 298.150 k
press: 1.00000 atm
elementType: 8 6 6 6 6 6 6 6 6 6 6 6 6 6 6 6 6 6 6 1 1 1 1 1 1 1 1 1 1 1 1 1 1
symmnumber: 1
zpe: 688974.9 jmol-1
zpe.correction: 0.262417 hartree
zpe.thermalcorrener: 0.276060 hartree
zpe.thermalcorrenthalpy: 0.277004 hartree
zpe.thermalcorrgfe: 0.222501 hartree
zpe.sumelectzpe: -768.273700 hartree
zpe.sumelectthermal: -768.260056 hartree
zpe.sumelectthermalent: -768.259112 hartree
zpe.sumelectthermalfe: -768.313616 hartree
dipole: 3.0259 1.4214 -0.0008
dipole: 3.3431
quadrupole: -123.1527 -95.8216 -114.4224
quadrupole: -7.8598 -0.0003 -0.0006
quadrupole: -12.0204 15.3106 -3.2902 -7.8598 -0.0003 -0.0006
hfenergy: -768.5361163 hartree
pointgroup: C01 [X(C18H14O1)]
dipole: 1.1798605 -0.5812962 0.0003114 debye
polarizability: 325.8920284|6.8657738|210.269132|0.0044088|-0.0122838|86.4053503 unknown
InChI: InChI=1S/C18H14O/c1-11-8-13-9-14(19)10-17(13)16-7-6-12-4-2-3-5-15(12)18(11)16/h2-8H,9-10H2,1H3
charge 0 multiplicity 1
33 atoms
O  -5.399384 1.085814 0.000268
C  -1.84103 0.39636 0.000227
C  -2.373841 -0.899884 0.000494
C  -0.431828 0.607478 -0.000217
C  -2.938529 1.442851 0.000296
C  0.488078 -0.521923 -0.000331
C  -3.887413 -0.889329 0.000717
C  -0.095109 -1.854699 -0.000259
C  -4.240846 0.612763 0.001985
C  -1.499155 -2.006692 0.00018
C  1.936934 -0.214362 -0.000121
C  0.056472 1.966354 -0.000381
C  2.369399 1.171524 -0.000256
C  1.404017 2.241247 -0.000476
C  0.681709 -3.165001 -0.000638
C  2.987695 -1.191494 0.000494
C  3.758209 1.506962 -0.000065
C  4.345863 -0.841743 0.000696
C  4.746531 0.519831 0.000364
H  -2.926959 2.109187 0.885584
H  -2.928201 2.108169 -0.885814
H  -4.337914 -1.378225 -0.885084
H  -4.33755 -1.379297 0.886068
H  -1.915297 -3.020769 0.000157
H  -0.673228 2.782429 -0.000383
H  1.767882 3.275138 -0.000545
H  1.319824 -3.277659 -0.896392
H  -0.023598 -4.012625 0.000192
H  1.321494 -3.2772 0.8940
H  2.756542 -2.251097 0.000927
H  4.035542 2.567757 -0.000208
H  5.102311 -1.634309 0.001165
H  5.807979 0.788245 0.000552
