program: Gaussian 09
title: 000181687
version: EM64L-G09RevD.01
frameworkgroup: C1[X(C8H18O)]
method: RPBEPBE
basis: SDD
operation: Freq
keyword: #pfreq=noraman
keyword: PBEPBE/SDD
title: #p freq=noraman PBEPBE/SDD
converged: YES YES NO NO
title: Mulliken charges:
elementType: O C C C C C C C C H H H H H H H H H H H H H H H H H H
charge: -0.452583 0.025145 -0.395924 -0.414464 -0.428960 -0.372947 -0.364841 -0.717807 -0.698575 0.178825 0.195149 0.187546 0.216879 0.216735 0.209377 0.197031 0.194518 0.205193 0.188040 0.199067 0.222465 0.223317 0.212838 0.210450 0.214785 0.209691 0.339048
chargesum: 0.00000
title: Mulliken charges with hydrogens summed into heavy atoms:
elementType: O C C C C C C C C
charge: -0.113535 0.203970 -0.013228 0.019150 -0.022552 0.026765 0.022267 -0.059188 -0.063649
polarizability: 1.07969077e+02 7.03383395e-01 8.58331418e+01 9.06755638e-01 1.03451481e+00 7.82058513e+01
1716.lowfreq: -7.0040 -0.0009 -0.0009 -0.0008 14.2474 30.3455 64.3136 67.3419 76.7819
frequency: 64.0035 66.7777 76.7543 90.6416 112.5445 157.0780 220.6960 240.7088 252.9379 269.8533 286.6163 306.1003 331.9273 403.6592 521.8606 538.9101 735.4052 763.0635 779.1973 822.6489 879.5600 889.6188 958.8229 979.1862 986.2602 1000.8022 1021.0176 1032.3825 1052.4087 1095.9919 1134.9973 1142.2253 1156.5324 1187.6745 1214.1547 1229.0913 1263.9907 1270.1967 1281.3426 1287.1991 1302.7382 1330.4585 1342.7511 1355.8395 1359.2392 1388.1642 1397.0748 1411.1553 1460.3333 1471.2491 1474.4983 1476.6663 1480.0762 1483.4254 1486.4424 1490.3261 1493.8010 2926.1878 2930.5712 2956.6074 2968.2194 2971.0380 2977.6969 2980.6326 2983.9639 2990.7020 2999.4667 3022.3354 3028.1672 3050.4017 3067.7490 3070.3723 3072.3108 3075.7761 3561.5928
redmass: 2.4177 3.0906 1.9511 1.9902 3.4727 1.5611 1.4139 1.4625 1.6822 2.3969 1.1187 4.1356 2.2688 2.8797 2.4849 2.2045 1.1525 1.5697 1.4525 1.2258 1.4011 1.7736 3.8413 2.2427 2.4453 1.4356 1.3394 1.9650 2.4253 2.0700 1.7971 2.3399 1.8771 1.2467 1.3046 1.3850 1.2233 1.1485 1.1536 1.1286 1.3006 1.4911 1.4682 1.6013 1.3402 1.2154 1.2232 1.4344 1.0741 1.0686 1.0641 1.0436 1.0582 1.0716 1.0729 1.0579 1.0785 1.0635 1.0741 1.0592 1.0587 1.0378 1.0821 1.0558 1.0646 1.0589 1.0973 1.0994 1.1019 1.1031 1.1005 1.0996 1.0989 1.0999 1.0664
irintensity: 0.3359 0.1709 5.1187 5.3924 1.5250 0.2262 1.6483 2.0060 2.2991 5.7234 146.6622 0.9406 2.4053 7.6094 1.7391 8.4731 6.6832 3.1388 16.2853 3.0817 3.1992 1.1249 44.7561 2.6136 40.6592 0.8673 0.5555 25.3402 0.2304 1.0611 4.6323 2.1661 1.0659 0.4915 25.4054 5.0368 11.1914 0.7006 1.7054 0.6907 4.2840 0.8106 6.1609 2.5109 0.9640 10.0313 19.9748 3.6754 0.2311 1.1961 4.7439 12.0746 2.3530 7.5396 34.4073 4.9668 2.6351 34.8162 46.3725 10.1457 53.7628 32.6506 79.5685 6.7874 48.3641 34.4125 10.3620 32.9894 27.4900 73.0370 87.0728 45.6173 51.3415 68.2589 2.0231
temp: 298.150 k
press: 1.00000 atm
elementType: 8 6 6 6 6 6 6 6 6 1 1 1 1 1 1 1 1 1 1 1 1 1 1 1 1 1 1
symmnumber: 1
zpe: 645641.7 jmol-1
zpe.correction: 0.245912 hartree
zpe.thermalcorrener: 0.258158 hartree
zpe.thermalcorrenthalpy: 0.259102 hartree
zpe.thermalcorrgfe: 0.207501 hartree
zpe.sumelectzpe: -390.080399 hartree
zpe.sumelectthermal: -390.068153 hartree
zpe.sumelectthermalent: -390.067209 hartree
zpe.sumelectthermalfe: -390.118810 hartree
dipole: 0.1116 1.1652 1.4872
dipole: 1.8926
quadrupole: -54.8876 -61.3228 -59.8217
quadrupole: 3.7624 5.3003 -1.6960
quadrupole: 3.7897 -2.6454 -1.1443 3.7624 5.3003 -1.6960
hfenergy: -390.3263112 hartree
pointgroup: C01 [X(C8H18O1)]
dipole: 0.0340448 0.4651571 0.5804313 debye
polarizability: 107.9341913|0.9220585|85.8708469|1.1608401|0.9689355|78.203032 unknown
InChI: InChI=1S/C8H18O/c1-3-5-8(4-2)6-7-9/h8-9H,3-7H2,1-2H3
charge 0 multiplicity 1
27 atoms
O  3.661253 -1.010193 -0.293755
C  0.013469 -0.085276 0.434937
C  -1.256525 -0.603237 -0.297144
C  1.282203 -0.617405 -0.286385
C  0.020393 1.461672 0.623537
C  -2.595309 -0.270639 0.401078
C  2.599328 -0.265837 0.41102
C  0.05074 2.283444 -0.686044
C  -3.80207 -0.949067 -0.283782
H  0.001324 -0.529269 1.456615
H  -1.277627 -0.209861 -1.334698
H  -1.174838 -1.706369 -0.393352
H  1.22422 -1.721916 -0.347728
H  1.320022 -0.24687 -1.328921
H  -0.872173 1.752931 1.211019
H  0.891815 1.74575 1.247254
H  -2.542586 -0.590823 1.462281
H  -2.755069 0.825634 0.413795
H  2.55388 -0.566291 1.481775
H  2.796008 0.826313 0.36163
H  -0.829499 2.070144 -1.319543
H  0.954387 2.066368 -1.284885
H  0.048527 3.367071 -0.467083
H  -3.887202 -0.631603 -1.340449
H  -4.751927 -0.69608 0.222459
H  -3.695368 -2.050338 -0.27408
H  4.540324 -0.779853 0.100149
