program: Gaussian 09
title: 000181852
version: EM64L-G09RevD.01
frameworkgroup: C1[X(C24H24O12)]
method: RPBEPBE
basis: SDD
operation: Freq
keyword: #p
keyword: freq=noraman
keyword: PBEPBE/SDD
title: #p freq=noraman PBEPBE/SDD
converged: NO YES NO NO
title: Mulliken charges:
elementType: O O O O O O O O O O O O C C C C C C C C C C C C C C C C C C C C C C C C H H H H H H H H H H H H H H H H H H H H H H H H
charge: -0.215064 -0.268753 -0.265246 -0.281062 -0.238021 -0.248189 -0.247773 -0.241126 -0.230668 -0.260980 -0.207507 -0.199328 -0.098260 -0.114284 -0.123016 -0.110290 -0.194354 -0.342261 0.311808 0.330625 0.321336 0.302421 0.076637 -0.341407 -0.794733 -0.778531 0.298964 0.291047 -0.759690 0.046906 -0.223208 -0.401810 -0.009452 -0.755297 -0.268757 -0.286434 0.295590 0.303115 0.329867 0.294171 0.303048 0.289429 0.266740 0.309257 0.239449 0.309136 0.239269 0.290679 0.244777 0.241076 0.250214 0.257251 0.254042 0.241932 0.290737 0.250836 0.246227 0.252734 0.260679 0.265503
chargesum: 0.00000
title: Mulliken charges with hydrogens summed into heavy atoms:
elementType: O O O O O O O O O O O O C C C C C C C C C C C C C C C C C C C C C C C C
charge: -0.215064 -0.268753 -0.265246 -0.281062 -0.238021 -0.248189 -0.247773 -0.241126 -0.230668 -0.260980 -0.207507 -0.199328 0.197331 0.188831 0.206851 0.183882 0.108694 0.213908 0.311808 0.330625 0.321336 0.302421 0.076637 -0.032150 -0.006879 -0.001999 0.298964 0.291047 0.001815 0.046906 0.018723 -0.111073 -0.009452 -0.005501 -0.008077 -0.020931
polarizability: 3.75167098e+02 2.16351686e+01 2.54932263e+02 -7.10495175e+00 1.95504737e+01 2.89844518e+02
1716.lowfreq: -8.2755 -0.0003 0.0004 0.0005 0.5507 4.3027 14.6669 18.4502 23.2968
frequency: 14.3913 18.3328 23.2668 28.6252 34.9709 35.5640 43.0778 47.4789 51.1196 52.3318 55.0319 65.6371 72.7754 75.9261 80.8691 90.8809 97.6810 104.4829 118.9703 123.1099 128.8821 144.4178 155.5078 174.6324 186.3442 190.5525 202.6053 216.4988 220.7693 235.3135 241.8871 258.5106 271.5939 284.6065 299.1121 317.1482 324.2448 350.2964 367.9436 399.3030 407.2238 429.8914 438.3238 449.8543 463.9534 467.7505 482.4550 498.5514 517.6360 526.2539 531.3755 560.1485 561.0971 569.4980 571.4395 581.7807 608.1972 610.5230 618.1211 629.5603 631.7801 642.0510 649.0950 685.7704 698.9647 740.8761 745.5278 762.0182 772.7195 787.7938 804.3083 820.8857 835.6357 836.6290 849.2782 866.3584 883.1678 904.8101 923.0956 934.1374 937.6714 951.6397 960.3770 968.9588 986.8357 996.6872 999.4778 1001.7152 1004.0840 1004.6722 1011.9019 1025.0958 1029.1650 1042.5556 1044.4914 1046.2417 1050.7183 1059.0872 1073.5841 1093.8806 1099.1694 1124.1447 1170.6892 1177.5476 1182.0341 1192.0755 1196.0118 1198.4407 1209.0454 1231.5175 1237.9518 1262.4125 1270.9500 1276.5197 1289.3414 1300.0394 1311.8271 1318.5059 1338.4780 1339.5488 1353.7605 1358.6362 1362.6978 1367.9299 1383.7346 1385.0539 1385.3059 1390.4847 1391.4872 1392.8230 1433.1307 1436.4692 1449.1948 1451.8247 1452.0062 1452.8420 1453.0221 1453.7760 1454.8218 1460.4923 1467.2512 1525.3281 1548.1112 1580.5526 1593.6645 1633.8745 1638.5855 1657.7002 1661.3890 1662.6999 3002.2316 3004.6906 3006.7042 3009.0028 3038.8222 3052.2362 3057.5229 3065.4765 3073.1977 3078.4127 3098.0276 3098.3656 3100.3178 3101.3204 3139.2787 3141.1704 3141.4891 3141.5805 3145.1890 3147.6823 3164.9569 3167.4303 3169.4346 3183.4153
redmass: 6.2375 1.0853 5.5083 3.9770 1.7440 3.8581 4.8315 7.3116 7.8699 5.9309 7.4800 6.6558 3.2084 6.1997 4.4619 4.7908 4.8793 4.0653 3.9886 1.2372 3.1121 6.2481 1.1246 5.5184 5.1156 6.7531 6.9805 6.2751 7.6104 6.8289 6.0242 4.5805 6.1748 4.7380 6.1599 4.0059 4.2625 4.5917 9.7737 4.5318 3.8017 3.2150 10.0589 6.0509 4.0711 4.3979 5.0060 4.5692 5.4484 4.7511 5.4999 3.4991 3.3383 3.4772 3.2976 4.7287 5.0008 5.7527 6.0598 3.5163 3.6328 5.5286 6.5552 5.0675 3.8089 5.1053 6.4678 5.6894 3.9112 1.8085 5.0783 6.3668 3.1897 6.1910 4.2246 1.9061 6.1756 5.0733 3.8207 5.4382 1.6098 3.9958 3.3514 3.7321 2.4368 2.4739 2.1485 1.3663 2.4851 1.3233 2.5022 4.0698 3.6912 1.8338 1.8090 2.5141 1.6873 1.6276 2.6908 1.7250 2.4074 2.1632 1.5865 2.9596 3.2362 2.0403 1.7699 2.0947 3.3933 2.6229 1.8830 1.2060 2.6193 1.4433 1.1895 2.6426 1.2138 1.2304 1.3099 1.2499 1.3546 2.0007 1.4311 1.6155 1.2627 1.2327 1.2506 1.4232 1.8605 2.2007 3.3211 1.1304 2.3049 1.0569 1.0576 1.0495 1.0626 1.0537 1.0550 1.0548 1.0587 9.9796 7.3276 7.0701 7.0867 7.3318 8.9198 9.6491 10.1484 9.7550 1.0373 1.0379 1.0386 1.0373 1.0830 1.0858 1.0857 1.0639 1.0855 1.0861 1.0965 1.0950 1.0937 1.0941 1.1019 1.0868 1.1025 1.1025 1.1013 1.0881 1.1032 1.1003 1.0942 1.0967
irintensity: 0.0281 0.3900 0.1971 0.6290 1.0493 0.9967 1.3579 0.8505 1.9365 0.9316 0.3409 1.1527 0.6470 5.9155 8.0953 4.2801 0.7102 1.6607 5.5664 3.6548 4.6757 0.1711 0.3082 4.3531 1.2859 5.1881 4.1181 6.3752 4.3046 8.6124 2.5285 0.4147 4.9915 3.6933 4.4783 23.5901 0.8224 7.8198 9.9193 21.4029 8.4482 15.1831 7.3661 8.4974 0.2334 7.1072 2.8593 5.4106 7.6411 4.8112 13.9940 3.6291 2.3492 1.4682 1.5613 7.2544 0.5813 18.1613 2.8513 14.8792 9.3738 10.5989 6.6836 6.4785 7.0383 29.0799 5.2587 1.5427 6.6187 50.9826 10.4439 40.8651 26.4247 323.5791 12.4318 26.4141 75.4787 85.5640 71.0886 177.0609 12.0293 101.8206 1.4718 78.0871 31.6690 162.1846 112.2672 2.9523 31.5037 0.0896 46.3066 55.4870 133.8909 10.1713 27.4354 34.2373 23.0889 26.0842 25.1301 25.3773 43.9015 63.1479 41.9523 314.9344 262.1409 212.8826 134.2753 146.6436 202.5868 164.0904 35.1713 53.6765 18.3659 4.6787 15.6010 221.8120 9.0879 3.4519 14.1041 4.7852 4.3531 3.6232 1.5270 7.0916 60.4911 34.4011 67.1239 47.8502 18.3666 12.5645 6.2981 32.5296 36.2990 8.1788 30.8768 17.9408 25.2814 5.3543 14.5410 18.7237 25.2996 76.2369 340.7889 94.5313 9.1056 10.7803 182.6033 170.5712 162.0172 177.8184 36.4213 4.8439 1.5665 0.6973 10.1108 8.2933 10.6364 3.2196 6.4403 0.9684 3.8984 12.0979 7.8202 4.5556 9.2754 0.5310 1.6729 14.6964 8.2194 7.4309 0.0968 15.6345 1.7565 1.9414
temp: 298.150 k
press: 1.00000 atm
elementType: 8 8 8 8 8 8 8 8 8 8 8 8 6 6 6 6 6 6 6 6 6 6 6 6 6 6 6 6 6 6 6 6 6 6 6 6 1 1 1 1 1 1 1 1 1 1 1 1 1 1 1 1 1 1 1 1 1 1 1 1
symmnumber: 1
zpe: 1172848.3 jmol-1
zpe.correction: 0.446714 hartree
zpe.thermalcorrener: 0.482845 hartree
zpe.thermalcorrenthalpy: 0.483789 hartree
zpe.thermalcorrgfe: 0.373054 hartree
zpe.sumelectzpe: -1828.988877 hartree
zpe.sumelectthermal: -1828.952747 hartree
zpe.sumelectthermalent: -1828.951803 hartree
zpe.sumelectthermalfe: -1829.062538 hartree
dipole: 1.2565 -1.5319 -0.8492
dipole: 2.1556
quadrupole: -226.5870 -200.8825 -192.2601
quadrupole: 2.9083 -3.4452 -8.3947
quadrupole: -20.0105 5.6940 14.3165 2.9083 -3.4452 -8.3947
hfenergy: -1829.4355918 hartree
pointgroup: C01 [X(C24H24O12)]
dipole: 0.49119 0.6492844 0.2374979 debye
polarizability: 375.9867643|-18.5882095|260.5222716|7.9827318|24.0885478|283.4348433 unknown
InChI: InChI=1S/C24H24O12/c1-11(25)31-10-19-21(32-12(2)26)22(33-13(3)27)23(34-14(4)28)24(36-19)35-18-7-5-6-15-16(29)8-9-17(30)20(15)18/h5-9,19,21-24H,10H2,1-4H3
charge 0 multiplicity 1
60 atoms
O  1.117357 0.360842 1.556634
O  1.503029 -0.957072 -1.7463
O  3.964108 0.161208 -0.911701
O  1.909334 -2.645851 1.528506
O  -0.780151 -0.461719 0.251094
O  1.216123 3.095079 -0.137703
O  1.356108 -3.165601 -2.477285
O  5.32615 0.868757 0.849612
O  -0.020326 -3.760304 2.21803
O  3.415003 3.616783 -0.718992
O  -2.1789 -0.890605 -2.018412
O  -6.614661 1.376913 0.271385
C  2.170102 -1.44987 -0.521779
C  2.981412 -0.308748 0.084742
C  1.110766 -1.927502 0.496916
C  2.100751 0.876207 0.557442
C  0.326581 -0.787204 1.187909
C  1.456086 1.689526 -0.58053
C  -1.900696 0.197324 0.766321
C  1.132373 -1.95287 -2.68127
C  5.101513 0.819347 -0.377937
C  1.212327 -3.589252 2.316002
C  -3.097436 0.196002 -0.02305
C  -1.87091 0.852173 2.027988
C  0.444528 -1.333591 -3.866548
C  5.906129 1.449032 -1.482627
C  2.301492 3.969225 -0.261499
C  -4.265508 0.820346 0.530383
C  2.170244 -4.310847 3.231179
C  -3.175409 -0.41606 -1.381815
C  -3.031183 1.466901 2.533948
C  -4.231606 1.444351 1.795718
C  -5.573973 0.820506 -0.206355
C  1.942532 5.346235 0.247436
C  -4.508837 -0.444099 -2.050569
C  -5.623553 0.135235 -1.517726
H  2.814204 -2.308363 -0.780403
H  3.514164 -0.696848 0.972861
H  0.393298 -2.624448 0.032603
H  2.731722 1.543328 1.166941
H  -0.10913 -1.146933 2.136259
H  0.467507 1.308124 -0.861072
H  2.128607 1.69584 -1.453464
H  -0.933355 0.914082 2.585011
H  0.458481 -2.035591 -4.713272
H  -0.602618 -1.123473 -3.581955
H  0.922184 -0.38072 -4.145091
H  5.46004 2.439778 -1.689564
H  5.859304 0.848631 -2.40425
H  6.948486 1.588213 -1.159704
H  1.607652 -4.928784 3.945307
H  2.837562 -4.958977 2.6356
H  2.807892 -3.589692 3.769223
H  -2.990896 1.970879 3.504975
H  -5.15002 1.906212 2.169869
H  2.108317 5.386873 1.339783
H  2.589856 6.098543 -0.227656
H  0.881665 5.571451 0.058409
H  -4.521694 -0.946146 -3.024797
H  -6.593132 0.128328 -2.027661
