program: Gaussian 09
title: 000181620
version: EM64L-G09RevD.01
frameworkgroup: C1[X(C10H6O4)]
method: RPBEPBE
basis: SDD
operation: Freq
keyword: #pfreq=noraman
keyword: PBEPBE/SDD
title: #p freq=noraman PBEPBE/SDD
converged: YES YES NO NO
title: Mulliken charges:
elementType: O O O O C C C C C C C C C C H H H H H H
charge: -0.219164 -0.198715 -0.378632 -0.265130 0.188548 0.199188 0.093457 0.111375 -0.348973 -0.332161 -0.242858 -0.238633 -0.202080 0.111413 0.285900 0.266175 0.302384 0.240966 0.241968 0.384973
chargesum: 0.00000
title: Mulliken charges with hydrogens summed into heavy atoms:
elementType: O O O O C C C C C C C C C C
charge: -0.219164 -0.198715 0.006342 -0.265130 0.188548 0.199188 0.093457 0.111375 -0.063073 -0.065987 0.059526 0.002333 0.039888 0.111413
polarizability: 1.84202172e+02 -2.76354362e+00 1.29311794e+02 6.77549762e-01 3.08358172e-02 4.66376425e+01
1716.lowfreq: -1.0317 -0.0010 -0.0009 -0.0001 6.7893 11.1631 18.0049 55.9433 128.6949
frequency: 17.8098 55.9402 128.6869 168.8014 222.3656 261.9647 296.7075 309.0794 370.5563 406.4777 465.5363 479.1193 515.5216 532.2255 537.1278 603.7437 617.4807 666.2359 678.5568 727.0998 732.8814 775.2812 808.9045 820.8301 885.1402 888.6316 942.4711 976.6236 1006.4994 1017.7728 1033.9865 1079.9469 1138.7365 1154.3358 1166.5043 1200.5147 1254.9779 1291.2047 1326.5585 1367.3123 1400.6711 1444.7244 1458.1763 1546.9938 1567.6513 1599.0426 1621.8946 1622.9186 3143.8379 3156.5424 3168.9508 3180.0513 3192.0136 3495.4664
redmass: 10.3237 8.6713 4.9376 7.0160 4.6827 7.6183 7.2685 9.2515 10.3665 3.2935 3.5618 8.4047 6.4057 3.8877 8.0729 1.5378 4.5379 5.5930 3.2538 5.2953 6.2944 1.4398 3.7468 5.7830 7.5791 1.4778 1.4224 1.3676 1.3366 3.0657 2.7648 2.9070 2.2391 1.6377 1.3172 2.7473 1.7946 1.7708 2.3175 3.5348 9.6996 2.6437 2.5684 7.1053 8.0178 8.3815 8.6212 7.5627 1.0864 1.0904 1.0957 1.1000 1.0950 1.0637
irintensity: 4.3799 1.1286 0.6419 1.4101 1.1520 0.0617 4.8090 2.4689 4.4976 6.0982 3.9282 0.1339 22.1568 5.1857 20.5649 106.1019 43.1350 25.2916 13.8876 26.6831 15.8591 119.7186 0.1716 20.2570 8.9684 0.1870 15.0591 3.4385 0.3643 93.3728 224.9493 25.7602 23.4402 4.0362 3.3399 7.8675 32.7330 188.9164 14.6369 50.7498 4.0769 92.5240 8.8244 104.3004 105.4751 203.8605 270.5988 67.7845 3.7022 3.4504 9.4868 12.4807 1.5297 37.5209
temp: 298.150 k
press: 1.00000 atm
elementType: 8 8 8 8 6 6 6 6 6 6 6 6 6 6 1 1 1 1 1 1
symmnumber: 1
zpe: 362044.3 jmol-1
zpe.correction: 0.137895 hartree
zpe.thermalcorrener: 0.148802 hartree
zpe.thermalcorrenthalpy: 0.149747 hartree
zpe.thermalcorrgfe: 0.099607 hartree
zpe.sumelectzpe: -684.583146 hartree
zpe.sumelectthermal: -684.572239 hartree
zpe.sumelectthermalent: -684.571295 hartree
zpe.sumelectthermalfe: -684.621434 hartree
dipole: 3.6094 -1.6228 0.3430
dipole: 3.9723
quadrupole: -64.7985 -82.8288 -81.0954
quadrupole: -2.9980 -1.2548 -0.3381
quadrupole: 11.4424 -6.5879 -4.8545 -2.9980 -1.2548 -0.3381
hfenergy: -684.7210412 hartree
pointgroup: C01 [X(C10H6O4)]
dipole: -1.4154079 0.6525762 0.114605 debye
dipolederiv: -1.520027 0.138096 -0.0199858 -0.0956511 -0.52082 -0.0128087 -0.0318741 -0.0047144 -0.1439455 -0.5463628 0.0660575 0.0065323 0.2162558 -0.914478 -0.0329364 0.0061787 -0.0366355 -0.3236261 -0.5313811 0.41123 -0.059513 0.53258 -0.9286674 0.0970638 -0.0723022 0.0962511 -0.4017021 -1.093783 -0.2866249 0.0270972 -0.2453587 -0.7457848 0.0669874 0.0063543 0.0527299 -0.3499482 -0.5309147 0.2069176 0.0035138 0.12052 -0.1887599 -0.006266 -0.0005825 -0.0066237 -0.0116712 0.843967 0.2365644 0.0185249 0.3267914 0.3001515 0.0137506 0.0133772 0.008169 0.0952624 1.047636 0.0093309 0.0091979 -0.0931254 1.1116829 0.0574071 -0.0072988 0.048151 0.2079947 -0.8605406 -0.1370703 -0.0254467 0.3080912 -0.6627422 -0.0044927 -0.0081396 -0.0008877 -0.072464 -0.0337271 -0.1386828 -0.0049499 0.0649827 0.0584582 0.0035545 0.0061793 0.0018608 -0.0985736 -0.315588 -0.1378098 -0.0072865 -0.1037908 0.0496132 0.0031551 -0.0042441 0.0041421 -0.1507982 1.0395202 -0.3850603 0.0073542 -0.6607569 0.5762788 0.0039389 0.0333318 -0.0017391 0.0566156 -0.0114769 0.2153972 0.0085436 0.1317457 -0.0393514 0.003071 0.0047281 0.0057654 -0.154883 0.1593838 -0.0179315 0.003024 -0.0348203 0.113211 0.00795 0.0014787 0.0062403 -0.1341074 2.0145668 -0.1007235 0.0360619 -0.2378822 1.2948093 -0.1886594 0.0427233 -0.1595187 0.2629131 0.1176165 0.0587623 0.0007961 -0.0147734 0.0221135 -0.0034657 -0.0020039 -0.0039418 0.1563227 0.1037592 0.0032706 -0.0003488 0.0328748 -0.0275271 -0.0054311 -0.0002004 -0.0054216 0.1799737 0.0941636 -0.0358247 -0.0040069 -0.0286129 0.0922076 -0.0037664 -0.0095841 -0.0020799 0.1646228 -0.0266671 -0.0890912 -0.0043129 -0.1006591 0.0078042 -0.0054114 -0.0042024 -0.0046205 0.1636591 -0.089594 0.0550077 -0.0009911 0.0521811 0.0823065 -0.0015676 -0.0009829 -0.0016281 0.1591895 0.1394491 -0.0718153 0.0061958 -0.170592 0.3194941 0.007927 0.0270637 0.0045013 0.3951658 unknown
polarizability: 184.1106222|-3.3769742|129.3703531|1.9484317|0.801923|46.6706333 unknown
InChI: InChI=1S/C10H6O4/c11-9-6-3-1-2-4-8(6)14-5-7(9)10(12)13/h1-5,12H
charge 0 multiplicity 1
20 atoms
O  -0.294797 1.882355 0.059761
O  0.815141 -2.163963 -0.078269
O  3.417063 -1.229753 0.267563
O  3.754422 1.042037 -0.02331
C  -0.925803 -0.498872 -0.010257
C  -1.289115 0.869439 0.024124
C  0.508181 -0.936706 -0.012621
C  1.475435 0.192683 0.050727
C  -1.971634 -1.458272 -0.048042
C  -2.628129 1.305804 0.022545
C  1.021944 1.4991 0.072321
C  -3.316783 -1.050427 -0.049144
C  -3.64494 0.332492 -0.014001
C  2.96182 0.067555 0.082913
H  -1.685147 -2.514585 -0.07701
H  -2.848553 2.376616 0.049353
H  1.702583 2.353616 0.10133
H  -4.116045 -1.797737 -0.077835
H  -4.693574 0.647402 -0.015628
H  4.414132 -1.211883 0.278579
