program: Gaussian 09
title: 000181605
version: EM64L-G09RevD.01
frameworkgroup: C1[X(C6H10N4OS)]
method: RPBEPBE
basis: SDD
operation: Freq
keyword: #p
keyword: freq=noraman
keyword: PBEPBE/SDD
title: #p freq=noraman PBEPBE/SDD
converged: NO NO NO NO
title: Mulliken charges:
elementType: S O N N N N C C C C C C H H H H H H H H H H
charge: 0.224608 -0.294397 -0.146020 -0.007792 -0.646168 -0.617037 0.170542 -0.061542 -0.196900 0.170161 -0.633388 -0.807534 0.286684 0.245751 0.245616 0.295417 0.295745 0.317128 0.350387 0.283337 0.283345 0.242058
chargesum: 0.00000
title: Mulliken charges with hydrogens summed into heavy atoms:
elementType: S O N N N N C C C C C C
charge: 0.224608 -0.294397 -0.146020 -0.007792 -0.055007 0.050479 0.170542 -0.061542 -0.196900 0.170161 0.144663 0.001205
polarizability: 1.57238663e+02 3.47970635e+00 1.41362469e+02 1.47838373e-02 -7.32622431e-03 5.80277096e+01
1716.lowfreq: -111.9992 -6.6388 -0.0026 -0.0019 -0.0017 5.8671 9.6988 66.6703 93.9642
frequency: -111.9700 66.6584 93.9579 112.9146 124.1604 161.2894 169.4839 178.8005 269.0468 277.6657 282.9991 310.5761 319.3368 364.7827 370.6444 460.7903 470.8158 548.7904 615.9433 626.9480 650.5850 653.2043 668.3116 694.5312 742.5517 784.0657 828.2448 930.4173 987.6676 993.0458 1006.2340 1066.5394 1121.3568 1175.8747 1184.4461 1210.4181 1266.9725 1319.4365 1344.5895 1412.1064 1433.0253 1438.8145 1451.8464 1471.2138 1487.4466 1517.1485 1542.9114 1595.8406 1615.5218 1661.4077 2988.6836 3025.1188 3080.6913 3111.9521 3149.5021 3162.0020 3410.7976 3508.1040 3511.3481 3690.3458
redmass: 1.0496 3.7887 3.0086 1.3954 2.9534 3.5408 1.4137 2.4064 4.6837 5.6517 3.2185 3.1338 4.0258 4.6176 8.2796 6.4524 1.1671 8.8071 9.2776 4.1204 1.6401 7.1393 7.2461 2.4587 8.6720 1.4314 5.7343 5.8947 1.1769 1.4421 2.0300 2.3881 1.3029 1.2531 3.0992 3.7594 5.9105 4.6679 1.1639 1.4956 1.0522 2.3446 1.1286 1.0695 1.0433 6.4240 1.7478 2.4121 9.0183 1.3324 1.0329 1.0284 1.1027 1.1002 1.1037 1.1059 1.0451 1.0948 1.0453 1.1036
irintensity: 14.4353 0.2008 4.0752 5.7530 5.3644 1.1465 0.2143 2.7757 0.4112 1.7150 18.2107 5.3215 9.7562 7.6295 14.4443 4.2901 217.8807 5.5745 0.0121 0.4974 53.2377 7.0854 1.0717 34.2930 27.7188 177.0633 7.2094 28.2877 6.9840 8.4214 6.6345 131.7290 0.2721 0.1193 8.4362 76.8396 19.3474 84.5248 1.2933 64.0952 14.1659 65.2058 12.6302 46.5291 20.4234 359.9595 8.5808 485.7216 296.3463 242.2295 29.0650 20.3375 17.8636 1.7424 6.8429 9.4301 1.5150 6.2250 101.6055 61.3961
temp: 298.150 k
press: 1.00000 atm
elementType: 16 8 7 7 7 7 6 6 6 6 6 6 1 1 1 1 1 1 1 1 1 1
symmnumber: 1
zpe: 440943.1 jmol-1
zpe.correction: 0.167946 hartree
zpe.thermalcorrener: 0.180491 hartree
zpe.thermalcorrenthalpy: 0.181435 hartree
zpe.thermalcorrgfe: 0.129386 hartree
zpe.sumelectzpe: -926.037679 hartree
zpe.sumelectthermal: -926.025135 hartree
zpe.sumelectthermalent: -926.024190 hartree
zpe.sumelectthermalfe: -926.076240 hartree
dipole: -1.8308 -3.0992 0.0065
dipole: 3.5996
quadrupole: -71.9139 -73.2112 -78.7615
quadrupole: -5.8030 0.0184 -0.0140
quadrupole: 2.7150 1.4176 -4.1326 -5.8030 0.0184 -0.0140
hfenergy: -926.2056257 hartree
pointgroup: C01 [X(C6H10N4O1S1)]
dipole: 0.6760533 1.2231991 -0.2287208 debye
dipolederiv: -0.7190931 -0.0886126 0.0640931 0.0574755 0.0102074 -0.0205893 0.0439691 -0.0085476 -0.1053365 -0.8012531 -0.411964 0.0949094 -0.4016961 -1.1896962 0.150479 0.0940565 0.1519656 -0.4056644 -1.143239 -0.3510524 0.1367795 -0.0470729 -0.8119605 0.1034868 0.0942754 0.1282222 -0.1423848 -1.3491899 0.3644813 0.0428014 0.7787932 -0.8986944 0.0317289 -0.0163166 0.0665892 -0.2280091 -0.6883439 0.1204996 0.0277019 0.190558 -0.4595061 0.030678 0.0183685 0.0364655 -0.1585066 -0.441926 0.4309016 -0.0803204 0.3467041 -1.396497 0.0754361 -0.0678442 0.0638999 -0.6637623 1.1824095 0.3148166 -0.131328 0.4607881 1.4711931 -0.2256672 -0.1507007 -0.2131074 0.2129589 0.390511 -0.1774129 -0.0231713 -0.1171226 -0.9865149 0.1254708 -0.0342099 0.1322072 -0.1879033 1.5096955 0.1537787 -0.1448728 -0.4937494 0.927769 -0.0863139 -0.0527185 -0.1403124 0.0604796 1.0308914 -0.2919841 -0.0287906 -0.3770472 1.7415493 -0.1906186 -0.0180779 -0.1979643 0.2197076 -0.0083038 -0.1212495 0.0358495 -0.1485192 0.2743212 0.0034001 0.0389797 0.0007679 0.2079052 0.0843358 0.0870716 -0.0142419 0.1094474 0.1133835 -0.0170009 -0.0179873 -0.0152424 0.0612179 0.126223 -0.1806014 0.0258444 -0.0145759 0.0965968 0.0063546 0.0023985 0.0205289 0.1303021 0.0171168 0.0884242 -0.1109281 0.0247065 0.0538569 -0.0412484 -0.1045677 -0.0055381 -0.021207 0.0477599 0.1118066 0.0703033 0.0550636 0.0569981 0.0071204 0.0809181 -0.0385214 -0.0545809 0.1225167 -0.0104671 0.0088282 -0.1301426 0.2473236 0.1226825 0.0268524 0.0417426 0.0957063 0.1216256 -0.0218686 -0.0027207 -0.1500146 0.1914351 -0.1276125 0.0163399 -0.0678427 0.1561339 0.1637143 -0.0044667 0.018745 -0.0410151 0.2737374 0.0184025 0.023998 0.0170963 0.3698963 0.265854 -0.0493919 0.0149251 0.0030572 0.2527828 0.0155013 0.0066335 0.0211219 0.3567489 0.115803 0.0371741 0.0496247 -0.0488209 -0.0402464 -0.0617755 0.0397714 -0.0473061 -0.0078087 0.0983392 0.0268946 -0.0788046 -0.0495699 -0.0082815 0.0725272 -0.0460862 0.0446188 -0.022241 -0.1254469 -0.0267774 0.0247727 -0.0072473 0.0802427 0.0075581 0.0219479 0.0091566 0.1263476 unknown
polarizability: 156.2965977|2.8020336|139.8761419|-8.6915307|-11.8972107|60.4561026 unknown
InChI: InChI=1S/C6H10N4OS/c1-10-5(11)3(7)4(8)9-6(10)12-2/h7-8H2,1-2H3
charge 0 multiplicity 1
22 atoms
S  2.93229 -0.335574 -0.339471
O  -1.764404 -2.215701 0.327199
N  0.373327 -1.234356 0.003339
N  0.615443 1.127309 -0.354128
N  -3.050329 0.428076 0.058197
N  -1.271488 2.535421 -0.396409
C  -1.094062 -1.153066 0.117048
C  -1.628906 0.177667 -0.027766
C  1.11747 -0.094178 -0.22179
C  -0.766603 1.26929 -0.257833
C  0.993305 -2.568529 0.140934
C  3.462506 1.440668 -0.632175
H  0.167602 -3.277501 0.30973
H  1.687659 -2.590348 0.999341
H  1.54044 -2.842106 -0.778442
H  -3.436146 0.185025 0.980937
H  -3.58047 -0.069165 -0.670505
H  -0.646092 3.318259 -0.565141
H  -2.285513 2.632856 -0.327118
H  3.149718 2.062558 0.217279
H  3.004067 1.813614 -1.557813
H  4.560288 1.404682 -0.71711
