program: Gaussian 09
title: 000181626
version: EM64L-G09RevD.01
frameworkgroup: C1[X(C24H18)]
method: RPBEPBE
basis: SDD
operation: Freq
keyword: #p
keyword: freq=noraman
keyword: PBEPBE/SDD
title: #p freq=noraman PBEPBE/SDD
converged: YES YES YES YES
title: Mulliken charges:
elementType: C C C C C C C C C C C C C C C C C C C C C C C C H H H H H H H H H H H H H H H H H H
charge: 0.331420 0.331421 0.328145 0.328146 -0.718679 -0.718678 0.138796 0.138796 0.314603 0.314604 0.460709 0.460709 -0.777341 -0.777340 -0.357518 -0.357518 -0.856345 -0.856345 -0.460835 -0.460834 -0.264148 -0.264149 -0.253125 -0.253125 0.243469 0.243469 0.235668 0.235668 0.222803 0.222802 0.245317 0.234029 0.234029 0.234029 0.245317 0.234030 0.243283 0.243283 0.226780 0.226780 0.228939 0.228939
chargesum: 0.00000
title: Mulliken charges with hydrogens summed into heavy atoms:
elementType: C C C C C C C C C C C C C C C C C C C C C C C C
charge: 0.331420 0.331421 0.328145 0.328146 -0.475210 -0.475209 0.138796 0.138796 0.314603 0.314604 0.460709 0.460709 -0.541673 -0.541672 -0.134716 -0.134716 -0.142970 -0.142970 -0.217552 -0.217551 -0.037368 -0.037368 -0.024187 -0.024187
polarizability: 5.18664704e+02 2.20560022e+01 2.95037364e+02 -6.77410844e-04 1.36058896e-03 1.05408291e+02
1716.lowfreq: -6.1371 -5.6720 -0.0009 -0.0006 0.0008 7.4773 30.3492 58.0802 88.2247
frequency: 30.3492 58.0802 88.2238 109.7160 115.2311 124.8311 189.7566 197.3890 202.2682 223.4739 228.3988 260.6646 288.0979 301.3391 308.1398 332.8604 338.4201 414.3779 421.2418 432.7575 440.6857 468.4481 470.2150 481.9442 502.5453 539.8178 550.6019 560.6834 577.7121 609.6724 622.8617 636.8279 656.8727 663.1063 711.3862 718.7936 728.4035 751.2588 759.9068 760.1849 807.5530 825.3652 846.0583 865.3598 866.8809 869.2613 902.2686 903.1268 914.5871 920.8621 940.4091 958.4953 958.9301 987.9196 987.9802 994.2238 1003.6770 1013.1528 1039.0480 1045.8392 1052.9924 1053.0913 1061.8829 1090.2817 1116.9769 1117.5832 1177.4124 1178.0984 1206.0855 1212.6970 1235.4836 1250.7766 1254.7927 1295.9372 1304.2224 1313.7588 1314.4251 1333.5415 1391.5471 1392.6069 1397.2599 1400.2809 1402.9466 1407.7983 1433.1001 1442.7718 1445.2061 1451.8868 1467.8902 1473.3508 1473.3853 1481.4621 1483.2393 1500.5676 1508.1113 1565.8565 1570.4169 1608.2755 1614.5099 1626.3319 1629.3226 1633.1370 2969.4084 2969.4586 3043.4220 3043.4566 3084.1855 3084.2497 3114.2196 3114.3050 3120.9126 3121.0000 3130.8076 3130.8164 3146.0442 3146.2079 3161.9194 3162.3202 3168.8214 3171.7607
redmass: 4.6922 4.2509 3.5259 3.4752 4.7718 4.3915 2.6663 3.2577 5.4417 1.0974 1.2526 3.3625 3.0711 3.2750 3.4388 4.9573 4.3095 2.9126 5.2987 5.5628 3.1571 7.0318 3.0945 4.9400 4.2271 3.0582 2.9011 3.4453 4.9258 3.3330 6.9404 6.1710 5.1490 5.0629 4.2014 6.1605 5.5129 2.4587 1.2658 1.5282 1.6235 2.1780 4.3260 1.3306 4.1847 1.5556 1.5346 7.0411 1.5765 1.9089 2.6782 1.4276 1.4243 1.3496 1.3490 1.9227 1.9128 4.9640 2.4310 2.0730 1.6072 1.6200 2.7253 2.1924 1.9471 2.1131 1.0731 1.0930 1.5034 1.6646 1.5970 2.6249 2.1992 1.7635 1.5770 2.2188 1.9652 3.9319 2.8782 3.2749 2.5251 1.5565 2.0783 3.0104 3.0768 2.7036 2.4007 5.4314 2.8185 1.0457 1.0457 1.1674 1.2538 2.7308 3.4247 5.5843 7.6740 5.3889 6.1141 6.6542 6.6683 6.3562 1.0378 1.0377 1.0972 1.0972 1.0980 1.0980 1.0913 1.0913 1.0860 1.0861 1.0882 1.0882 1.0942 1.0942 1.0992 1.0999 1.0893 1.0890
irintensity: 0.0173 0.3644 0.0000 4.3355 0.1345 0.0000 1.0497 0.0000 0.0000 0.0000 0.3478 0.0000 1.5947 0.0378 0.0000 0.0000 0.0000 2.5013 2.5737 0.0000 9.2166 4.3869 0.0000 0.0000 2.8619 11.0548 4.4977 0.0000 0.0000 0.0000 0.0000 14.7803 0.4637 0.0000 4.8896 0.0000 2.2133 0.0000 139.3485 0.0005 0.0000 10.0876 0.0000 0.0000 0.5289 18.8321 7.5102 0.0000 0.0000 45.4605 0.0000 0.0001 15.5970 0.5465 0.0001 8.7729 0.0000 2.0313 0.0000 12.5422 15.0706 0.0000 0.0000 4.8225 0.0000 5.4068 0.0000 2.2325 0.0000 6.6929 5.9577 13.5362 0.0000 0.0000 0.0000 0.0000 2.3786 7.6626 5.1544 0.0000 33.2548 0.0000 12.6453 0.0000 2.9123 38.0567 0.0000 0.0000 4.5619 0.0004 29.3323 18.2112 0.0000 0.0000 39.3028 7.5198 0.0000 0.0000 3.7420 0.0000 0.0000 12.9417 0.0297 64.5584 0.0567 37.7976 43.6667 0.0015 31.5185 0.0003 18.9762 0.0342 1.2386 12.0997 59.5253 0.0128 63.0457 0.0003 45.7856 0.0000
temp: 298.150 k
press: 1.00000 atm
elementType: 6 6 6 6 6 6 6 6 6 6 6 6 6 6 6 6 6 6 6 6 6 6 6 6 1 1 1 1 1 1 1 1 1 1 1 1 1 1 1 1 1 1
symmnumber: 1
zpe: 889920.9 jmol-1
zpe.correction: 0.338953 hartree
zpe.thermalcorrener: 0.357146 hartree
zpe.thermalcorrenthalpy: 0.358090 hartree
zpe.thermalcorrgfe: 0.293556 hartree
zpe.sumelectzpe: -923.812630 hartree
zpe.sumelectthermal: -923.794437 hartree
zpe.sumelectthermalent: -923.793493 hartree
zpe.sumelectthermalfe: -923.858027 hartree
dipole: 0.0000 0.0000 0.0000
dipole: 0.0000
quadrupole: -122.5788 -117.6610 -149.5821
quadrupole: -0.8231 0.0000 0.0003
quadrupole: 7.3618 12.2796 -19.6415 -0.8231 0.0000 0.0003
hfenergy: -924.1515829 hartree
pointgroup: C01 [X(C24H18)]
dipole: 0. 0.0000004 0.0000063 debye
polarizability: 518.773265|-21.4983306|294.9288034|-0.000674|-0.0013623|105.4082914 unknown
InChI: InChI=1S/C24H18/c1-15-11-17-7-3-5-9-19(17)23-14-22-16(2)12-18-8-4-6-10-20(18)24(22)13-21(15)23/h3-14H,1-2H3
charge 0 multiplicity 1
42 atoms
C  1.428237 -0.230225 -0.00006
C  -1.428237 0.23024 -0.000061
C  0.897662 1.119908 -0.00008
C  -0.897662 -1.119894 -0.000071
C  0.507631 -1.303557 -0.000069
C  -0.507632 1.303571 -0.000076
C  2.881766 -0.441666 -0.000038
C  -2.881767 0.44168 -0.00004
C  1.806936 2.265661 -0.00011
C  -1.806937 -2.265647 -0.000084
C  3.744932 0.710036 -0.000075
C  -3.744933 -0.710021 -0.000049
C  3.17153 2.038734 -0.000116
C  -3.17153 -2.03872 -0.000076
C  3.486981 -1.734407 0.000027
C  -3.486981 1.734421 -0.000005
C  1.26335 3.681667 -0.000136
C  -1.26335 -3.681652 -0.000105
C  5.162062 0.535073 -0.000062
C  -5.162062 -0.535058 -0.000027
C  4.881829 -1.888515 0.00004
C  -4.881829 1.88853 0.000016
C  5.73003 -0.745669 -0.000008
C  -5.73003 0.745683 0.000005
H  0.887053 -2.32792 -0.000082
H  -0.887052 2.327935 -0.00009
H  3.862183 2.891756 -0.000147
H  -3.862183 -2.891742 -0.000087
H  2.86226 -2.633101 0.000077
H  -2.86226 2.633116 0.00001
H  2.08662 4.415417 -0.000167
H  0.636074 3.878879 -0.890758
H  0.636103 3.878922 0.890497
H  -0.636072 -3.878866 -0.890725
H  -2.086619 -4.415403 -0.000137
H  -0.636106 -3.878905 0.89053
H  5.803768 1.424425 -0.000092
H  -5.803769 -1.424411 -0.000034
H  5.319734 -2.892785 0.000093
H  -5.319734 2.8928 0.000044
H  6.818359 -0.870197 0.000002
H  -6.818359 0.870211 0.000022
