program: Gaussian 09
title: 000016481
version: EM64L-G09RevD.01
frameworkgroup: C1[X(C7H4BrNS)]
method: RPBEPBE
basis: SDD
operation: Freq
keyword: #p
keyword: freq=noraman
keyword: PBEPBE/SDD
title: #p freq=noraman PBEPBE/SDD
converged: NO YES NO NO
title: Mulliken charges:
elementType: Br S N C C C C C C C H H H H
charge: 0.024312 0.151330 0.302568 0.499300 -0.341129 -0.384309 -0.142457 -0.170745 -0.214881 -0.766215 0.277896 0.261541 0.244086 0.258704
chargesum: 0.00000
title: Mulliken charges with hydrogens summed into heavy atoms:
elementType: Br S N C C C C C C C
charge: 0.024312 0.151330 0.302568 0.499300 -0.063233 -0.122768 -0.142457 0.073341 0.043823 -0.766215
polarizability: 2.28281631e+02 -2.16779382e+01 1.13351375e+02 -3.62598234e-02 -5.90977277e-03 3.89421687e+01
1716.lowfreq: -9.7649 -9.0868 -0.0024 -0.0023 -0.0021 1.3061 15.8320 66.2379 159.4388
frequency: 15.7792 66.2249 159.4385 187.2605 249.2291 284.4160 362.0589 385.6000 418.9568 440.0501 450.2684 565.1644 641.9697 680.4278 699.5850 788.6062 886.7620 906.1003 929.5328 977.6907 979.9995 1061.8768 1092.2173 1176.8920 1257.0009 1292.3761 1360.4170 1415.5060 1459.7998 1556.7845 1594.1026 2197.4755 3150.6318 3172.1826 3179.7118 3184.9480
redmass: 14.4506 7.5450 5.2721 10.4935 5.4903 11.3552 9.2808 9.3252 6.8239 3.7801 6.8974 5.4864 7.3467 2.1833 9.8805 1.3947 1.4513 1.4240 8.0887 5.8343 1.3397 2.0608 1.5627 1.0813 2.2772 1.6187 6.4769 3.2362 2.5471 6.4346 6.6573 12.8872 1.0877 1.0938 1.0938 1.0987
irintensity: 0.1406 0.0197 0.3584 0.1400 0.0035 3.5061 3.1323 0.9699 0.4160 6.8404 1.5405 0.1144 2.8586 29.5454 113.7435 54.9339 21.3822 5.7805 24.1602 8.6197 0.7945 23.1343 3.4437 0.8509 6.8974 1.0403 1.4678 8.9273 77.1995 81.9120 122.7449 1462.0413 6.4051 2.5566 1.5236 4.4207
temp: 298.150 k
press: 1.00000 atm
elementType: 35 16 7 6 6 6 6 6 6 6 1 1 1 1
symmnumber: 1
zpe: 234629.8 jmol-1
zpe.correction: 0.089366 hartree
zpe.thermalcorrener: 0.098542 hartree
zpe.thermalcorrenthalpy: 0.099486 hartree
zpe.thermalcorrgfe: 0.051523 hartree
zpe.sumelectzpe: -734.726097 hartree
zpe.sumelectthermal: -734.716921 hartree
zpe.sumelectthermalent: -734.715977 hartree
zpe.sumelectthermalfe: -734.763939 hartree
dipole: -1.6260 2.4209 0.0003
dipole: 2.9162
quadrupole: -85.8156 -65.3057 -77.1590
quadrupole: 1.1695 0.0190 -0.0139
quadrupole: -9.7221 10.7877 -1.0656 1.1695 0.0190 -0.0139
hfenergy: -734.8154625 hartree
pointgroup: C01 [X(C7H4Br1N1S1)]
dipole: -0.7585449 -0.8520037 0.1228217 debye
dipolederiv: -0.465504 0.2852828 -0.0248671 0.4097282 -0.3581054 0.0311872 -0.0402962 0.0342259 -0.0301273 -1.3568262 -0.2571559 0.0609023 -0.3264623 -0.1202823 0.0149195 0.0742989 0.0144021 -0.062274 -2.702848 -0.4924937 0.1222956 -0.635434 -0.2791968 0.0460411 0.1293039 0.0404045 -0.0319221 1.6320775 0.2510882 -0.069565 0.254885 0.3443451 -0.0352825 -0.0665774 -0.034324 0.1177804 -0.6201882 0.0829645 0.0018446 0.307108 -0.1491807 -0.003381 -0.0249065 0.002774 -0.1143029 -0.3103491 -0.0750165 0.0124767 -0.2361266 -0.0912416 -0.0037645 0.0334644 -0.0079552 -0.1698246 0.8761175 -0.5461466 0.0438775 -0.7771261 0.6691297 -0.0774081 0.071981 -0.0830762 -0.0971495 0.1826632 -0.049986 -0.0014712 0.0921602 0.1253075 -0.0328992 -0.0194189 -0.0295985 -0.1175382 -0.3052769 0.1931391 -0.0194575 0.1834437 -0.3137509 0.0204523 -0.0182526 0.0200734 -0.1154925 2.9489813 0.621377 -0.1416483 0.765232 0.1114658 -0.0377165 -0.1587174 -0.0344929 -0.052522 0.0975123 -0.0330843 0.0061231 -0.0458544 0.0082898 0.0217469 0.0079106 0.0215581 0.1727931 0.0140787 0.082807 -0.0061948 0.0770848 0.035094 0.0156249 -0.0053009 0.0154971 0.1743781 0.0431221 -0.0296381 0.0065701 -0.0457951 -0.0808926 0.0312694 0.0086279 0.0309505 0.1585431 -0.0335601 -0.0331374 0.009114 -0.0228434 0.0990185 0.0092105 0.0078833 0.0095613 0.1676584 unknown
polarizability: 231.8314101|5.4388276|108.6035517|-5.2178508|-8.7182049|40.1402136 unknown
InChI: InChI=1S/C7H4BrNS/c8-6-2-1-3-7(4-6)9-5-10/h1-4H
charge 0 multiplicity 1
14 atoms
Br -3.254985 1.869139 -0.156719
S  4.533296 0.840956 -0.213894
N  1.788069 0.149571 -0.07023
C  0.453332 -0.186975 0.005934
C  -0.535875 0.832634 -0.094662
C  0.067981 -1.544466 0.184029
C  -1.890834 0.466798 -0.015768
C  -1.299793 -1.871955 0.258378
C  -2.297131 -0.872923 0.159707
C  2.956952 0.445475 -0.127206
H  -0.232625 1.873602 -0.230669
H  0.838751 -2.316722 0.260644
H  -1.599406 -2.915772 0.395092
H  -3.35723 -1.132262 0.218264
