program: Gaussian 09
title: 000181575
version: EM64L-G09RevD.01
frameworkgroup: C1[X(C8H12O)]
method: RPBEPBE
basis: SDD
operation: Freq
keyword: #pfreq=noraman
keyword: PBEPBE/SDD
title: #p freq=noraman PBEPBE/SDD
converged: YES YES NO NO
title: Mulliken charges:
elementType: O C C C C C C C C H H H H H H H H H H H H
charge: -0.238054 -0.448654 -0.140062 -0.665304 -0.226340 -0.149303 -0.305832 0.196350 -0.785540 0.215760 0.214372 0.219638 0.223267 0.226571 0.213679 0.238387 0.234430 0.251891 0.232913 0.258595 0.233236
chargesum: 0.00000
title: Mulliken charges with hydrogens summed into heavy atoms:
elementType: O C C C C C C C C
charge: -0.238054 -0.018522 0.079575 -0.001787 0.012047 0.085127 -0.053941 0.196350 -0.060796
polarizability: 1.89835787e+02 -1.43158134e+01 8.08839678e+01 7.72462767e+00 -2.86347481e+00 5.52678627e+01
1716.lowfreq: -7.3305 -3.9927 -0.0006 -0.0005 0.0005 10.0633 44.3534 70.3056 94.9693
frequency: 44.3398 70.2578 94.9248 96.0637 107.1718 198.8046 225.2528 234.4147 263.9950 332.7803 406.6563 437.5399 534.2881 562.1078 566.7443 771.5375 812.0052 824.5794 891.7413 906.7068 947.6435 984.7000 1009.4550 1017.5822 1024.7010 1062.3438 1127.2233 1182.3797 1217.1881 1248.0042 1270.7801 1282.8639 1290.9809 1300.5319 1339.3465 1367.0944 1388.3326 1447.9316 1460.6821 1463.2238 1475.3625 1484.1565 1567.3854 1615.4619 1650.7657 2962.6780 2982.7613 2985.0704 3032.2332 3071.0809 3071.1339 3081.4835 3088.3854 3091.7367 3102.2149 3120.3623 3123.0110
redmass: 3.2082 3.4733 2.1979 1.1726 2.6861 1.4673 2.5805 2.2241 2.2576 3.6882 2.8429 2.7738 3.0708 3.0694 3.0153 1.2508 3.3305 1.4966 1.8708 1.7204 1.1577 1.6598 1.1511 1.9687 1.7753 1.7430 2.0944 2.3285 1.4177 1.2229 2.1102 1.9016 1.3361 1.2852 1.5011 1.2587 1.1985 1.1023 1.0797 1.0501 1.0436 1.0603 6.6708 5.7435 5.7088 1.0632 1.0352 1.0371 1.0957 1.0973 1.0926 1.0991 1.1010 1.0912 1.0905 1.0925 1.0957
irintensity: 1.5361 1.1494 2.0970 0.8198 1.6887 0.6667 0.4645 0.3819 0.0512 1.4126 1.4186 0.9662 11.9183 4.2855 6.8659 12.8180 3.8389 4.1963 0.1225 7.0963 0.9630 21.7036 95.8572 36.9478 0.8914 3.2030 13.8654 2.6425 8.0498 23.1004 183.2248 29.5006 5.1085 11.4593 14.7353 53.0618 7.1370 25.6887 12.0986 19.8737 11.7659 11.6278 172.2836 126.0595 97.8123 28.6928 45.6225 5.1604 6.4795 16.3085 3.8497 61.1630 41.9594 1.4784 33.7100 28.5099 6.6970
temp: 298.150 k
press: 1.00000 atm
elementType: 8 6 6 6 6 6 6 6 6 1 1 1 1 1 1 1 1 1 1 1 1
symmnumber: 1
zpe: 462477.4 jmol-1
zpe.correction: 0.176148 hartree
zpe.thermalcorrener: 0.187148 hartree
zpe.thermalcorrenthalpy: 0.188092 hartree
zpe.thermalcorrgfe: 0.138672 hartree
zpe.sumelectzpe: -386.545526 hartree
zpe.sumelectthermal: -386.534527 hartree
zpe.sumelectthermalent: -386.533583 hartree
zpe.sumelectthermalfe: -386.583002 hartree
dipole: -4.9574 2.2053 -0.5467
dipole: 5.4533
quadrupole: -66.4405 -52.5693 -57.2561
quadrupole: 8.7998 -0.9826 -0.2084
quadrupole: -7.6852 6.1860 1.4992 8.7998 -0.9826 -0.2084
hfenergy: -386.7216748 hartree
pointgroup: C01 [X(C8H12O1)]
dipole: -1.9627062 -0.8359331 -0.2281877 debye
dipolederiv: -1.2277087 -0.1798781 -0.0371184 -0.2515787 -0.632069 -0.0901092 -0.0461632 -0.0905 -0.3664663 -0.218432 0.0212892 -0.0301672 -0.142336 0.1162544 -0.0215096 -0.0993628 -0.035679 0.0824459 0.5917823 0.0065647 -0.0096086 0.13684 0.1292178 0.0969903 -0.0591283 0.1111806 -0.2121517 -0.0044218 -0.0009874 -0.0455662 0.1322965 0.096581 0.0012271 0.1363514 0.0050205 0.0369011 -0.6551869 0.0053929 -0.0155097 -0.1740749 0.0694267 0.0843051 -0.0341956 0.0788045 -0.1233293 0.8621261 0.0321197 -0.0142718 0.02051 0.0779857 0.0516158 -0.0278067 0.0568534 -0.0778489 -1.2291521 0.0095116 0.0208459 0.1650329 0.0024265 0.0620891 0.097931 0.064891 -0.1679128 1.8597707 0.0775583 -0.0212117 -0.4199785 0.8405097 0.2453675 -0.2147477 0.2338369 0.2083846 -0.0378192 0.0400533 0.0163592 0.2156719 -0.4192376 -0.165729 0.0759633 -0.1615578 0.0089953 0.0300215 -0.0408154 -0.0395056 0.0519291 -0.1276436 -0.1004775 -0.0249966 -0.0732245 0.0369241 -0.0774683 -0.0514959 0.0667271 0.0195488 0.0290616 0.1185063 0.0939367 0.0880493 -0.0491212 0.0307943 0.0381117 0.0147616 0.0489151 -0.0980697 -0.0846648 0.040089 -0.0937442 0.1230333 -0.2492335 0.0660742 0.0019508 0.0883121 0.0797574 -0.0152069 -0.0114586 -0.0238866 0.061253 0.0790262 -0.067498 0.0774841 -0.046416 0.0143845 0.1095865 0.0072174 0.0891762 -0.0661876 0.1177705 0.0187179 -0.010514 -0.0418001 -0.1474414 -0.0995993 -0.0188627 -0.0585957 0.0403833 0.0309358 0.0078173 0.007399 0.0674254 -0.0723871 -0.0793237 0.0268955 -0.0782177 0.1331146 0.073021 -0.0134381 -0.0006442 0.0619316 -0.0779167 -0.0761776 0.0263659 -0.0752417 0.1226455 0.0312373 0.0383348 0.0191543 0.0712411 -0.0612409 -0.0783369 0.0304035 -0.0783458 0.1395131 0.0431385 -0.0079453 -0.1188718 0.011421 0.0797075 -0.0042571 -0.0755302 -0.0358582 -0.0500345 -0.1084686 0.069869 0.0324716 0.0156023 0.0891086 -0.0112866 0.0154206 -0.0140103 0.1158768 0.0582668 -0.0693564 0.0858357 -0.0304936 0.0115845 0.0569906 0.061678 0.0910491 0.0035816 unknown
polarizability: 190.4095676|13.3758149|78.140593|3.9332266|8.0752752|57.437457 unknown
InChI: InChI=1S/C8H12O/c1-3-4-5-6-7-8(2)9/h4-7H,3H2,1-2H3
charge 0 multiplicity 1
21 atoms
O  3.849658 0.808772 0.306166
C  -3.564009 0.153181 0.39341
C  -2.16063 -0.355079 0.172857
C  -4.437688 0.056139 -0.88648
C  -1.014896 0.371241 0.365229
C  0.321751 -0.156144 0.132752
C  1.479546 0.560785 0.322795
C  2.849978 0.050886 0.095037
C  3.052105 -1.385169 -0.39135
H  -3.535917 1.199063 0.752616
H  -4.047589 -0.446772 1.192998
H  -2.073281 -1.395025 -0.183578
H  -5.46733 0.401172 -0.682548
H  -4.018764 0.677525 -1.697628
H  -4.494957 -0.985978 -1.251673
H  -1.090174 1.41135 0.715052
H  0.382503 -1.197725 -0.216708
H  1.434599 1.601682 0.67179
H  2.55555 -1.551693 -1.365371
H  4.130813 -1.574069 -0.502264
H  2.631533 -2.113042 0.327301
